program: Gaussian 09
title: 000138488
version: EM64L-G09RevD.01
frameworkgroup: C1[X(C7H13ClO2)]
method: RPBEPBE
basis: SDD
operation: Freq
keyword: #p
keyword: freq=noraman
keyword: PBEPBE/SDD
title: #p freq=noraman PBEPBE/SDD
converged: YES YES NO NO
title: Mulliken charges:
elementType: Cl O O C C C C C C C H H H H H H H H H H H H H
charge: -0.015533 -0.267386 -0.209055 -0.345891 -0.383364 -0.350965 -0.275853 -0.690779 0.348251 -0.692767 0.191214 0.191263 0.210911 0.210883 0.197649 0.197644 0.231016 0.231192 0.211040 0.211053 0.219368 0.290034 0.290072
chargesum: 0.00000
title: Mulliken charges with hydrogens summed into heavy atoms:
elementType: Cl O O C C C C C C C
charge: -0.015533 -0.267386 -0.209055 0.036587 0.038431 0.044328 0.186355 -0.049318 0.348251 -0.112661
polarizability: 1.30458319e+02 4.37356632e+00 8.04836507e+01 -1.24817441e-01 -8.60720621e-02 6.48488360e+01
1716.lowfreq: -7.9401 -1.2187 0.0007 0.0024 0.0028 6.2736 18.7946 33.6791 54.9084
frequency: -5.2333 32.8943 54.7919 54.9295 99.6026 120.1328 148.0460 173.0568 207.1808 223.1124 239.2255 322.3888 417.1797 464.1690 539.4659 651.2623 731.7539 735.6789 764.1214 844.1755 853.9886 897.4547 915.2611 941.3497 966.4808 1020.8143 1067.5880 1077.1961 1116.9516 1126.7016 1147.5716 1149.9676 1202.4663 1252.2115 1258.6672 1281.0800 1283.4982 1295.1266 1317.7003 1356.4923 1372.6331 1390.3503 1422.8700 1468.2579 1468.9710 1475.2897 1476.4309 1483.4357 1491.2448 1671.3815 2960.6231 2972.5643 2974.8102 2993.0249 3000.8971 3005.2459 3027.0713 3049.0364 3060.1420 3070.9444 3075.6526 3080.2946 3135.4771
redmass: 4.2874 4.2659 2.2726 4.2351 2.4057 1.8523 4.6974 2.7994 6.0968 1.1258 7.2619 3.9254 4.3718 3.6710 2.9122 7.0238 1.0680 6.7428 1.1060 1.1794 5.8841 2.2512 1.8023 5.2824 1.1618 3.7309 2.4702 2.5739 3.5929 2.6085 1.3728 1.1728 1.4384 1.2835 1.2139 1.4277 1.1028 1.0840 1.3511 1.5509 1.5196 1.2205 1.0869 1.0800 1.0705 1.0670 1.0422 1.0757 1.0944 10.6906 1.0587 1.0593 1.0365 1.0598 1.0990 1.0567 1.1028 1.1042 1.0570 1.1013 1.0993 1.1079 1.1074
irintensity: 3.4932 0.0029 1.3866 0.8882 0.4873 2.0950 1.0909 6.9907 0.6062 0.0052 4.6310 4.1930 9.0771 2.0727 2.5172 7.0661 11.2385 29.3965 0.0162 1.0982 4.8233 18.1229 7.7106 75.5615 1.2769 8.5642 64.2572 11.2438 372.6683 24.2344 0.9528 0.3727 0.6637 4.9146 0.0047 29.0564 0.2331 0.6773 1.5756 1.5600 3.3385 12.7754 29.2619 0.1413 0.2628 4.5466 13.1733 0.1387 25.4230 163.3408 5.6397 52.7832 33.6275 21.2028 0.8016 37.0906 16.2396 10.0847 8.3919 53.1283 49.7099 93.1004 1.8733
temp: 298.150 k
press: 1.00000 atm
elementType: 17 8 8 6 6 6 6 6 6 6 1 1 1 1 1 1 1 1 1 1 1 1 1
symmnumber: 1
zpe: 499311.6 jmol-1
zpe.correction: 0.190178 hartree
zpe.thermalcorrener: 0.202005 hartree
zpe.thermalcorrenthalpy: 0.202949 hartree
zpe.thermalcorrgfe: 0.150218 hartree
zpe.sumelectzpe: -884.231826 hartree
zpe.sumelectthermal: -884.219999 hartree
zpe.sumelectthermalent: -884.219055 hartree
zpe.sumelectthermalfe: -884.271785 hartree
dipole: -3.7157 -2.2108 0.0320
dipole: 4.3238
quadrupole: -76.7769 -71.3645 -65.9938
quadrupole: -7.2761 0.0984 -0.0290
quadrupole: -5.3985 0.0139 5.3846 -7.2761 0.0984 -0.0290
hfenergy: -884.4220036 hartree
pointgroup: C01 [X(C7H13Cl1O2)]
dipole: -1.4764979 -0.8445695 0.021895 debye
dipolederiv: -0.4742649 -0.0280534 0.0041556 -0.083714 -0.1363423 0.0013614 0.006211 0.0004053 -0.1364855 -1.9462895 -0.1466646 0.0060367 -0.0923491 -0.5131398 0.0006751 0.0055102 0.001533 -0.2779876 -0.6753316 0.0408949 0.0007223 -0.329303 -0.8567875 0.0039039 0.0015586 0.0030277 -0.2880929 -0.0326926 -0.0215388 0.0003629 -0.1323449 0.0658373 0.0007768 0.0006241 0.0002778 0.1879261 -0.1543359 0.0074184 0.0006002 0.0254578 0.0673412 -0.0002424 0.0004143 0.0000696 0.1562449 0.0539524 0.0142458 0.0001551 0.090962 0.1049329 -0.0001022 -0.0000885 0.0002312 0.1741109 0.9594629 -0.0508948 -0.0020086 -0.2355672 0.243796 0.0018143 -0.0019137 0.0010039 0.3555714 -0.085457 0.0382286 0.000142 -0.0071325 0.0501842 0.0002139 0.000187 0.0000966 0.0947434 1.7482537 0.0968133 -0.0031642 0.3456169 1.1366702 -0.0046838 0.0004348 -0.0065572 0.1979634 0.4835015 0.1953479 -0.008904 0.4042026 -0.0572994 -0.0010384 -0.0153679 0.0022318 0.1639252 0.0428569 -0.0014465 0.001673 0.0081881 -0.0409691 0.1148335 -0.0017735 0.1389838 -0.086921 0.0427957 -0.0018173 -0.0020358 0.0079088 -0.0420446 -0.1150902 0.0013787 -0.1392046 -0.0859045 0.0642293 -0.0004993 -0.0029069 -0.0086221 -0.0180437 -0.1023175 0.0112349 -0.1202624 -0.0682056 0.0640816 -0.0000326 0.002353 -0.0083156 -0.0169281 0.1021243 -0.0116491 0.1200861 -0.0694423 0.0260074 0.0250278 0.0287413 -0.0028433 -0.043451 -0.1208264 0.007477 -0.1496048 -0.0868358 0.0259105 0.0250887 -0.0290929 -0.0027146 -0.0419947 0.1206076 -0.0076458 0.1493228 -0.0882827 -0.0378793 -0.0022987 -0.0175726 0.0642311 -0.0027603 -0.0765882 -0.0020834 -0.0945584 -0.057883 -0.0380483 -0.0016946 0.017614 0.0649994 -0.0018044 0.0756435 0.0016206 0.0939277 -0.0582853 0.0802405 0.0023062 -0.0208015 0.0512544 -0.0143491 -0.1218903 0.0272888 -0.1366822 -0.0866927 0.0802017 0.0026634 0.0204492 0.0513175 -0.0128941 0.1213448 -0.0278822 0.1362424 -0.0880909 -0.1680495 -0.1010248 0.0006012 -0.1351825 0.0001436 0.000421 0.0006245 0.0003819 0.1019245 -0.0296217 -0.048174 -0.0340078 -0.0394977 0.0623008 -0.0641929 -0.0109305 -0.0795731 0.0267675 -0.0295237 -0.0438955 0.0368878 -0.0365522 0.0676018 0.0632521 0.01477 0.0786212 0.0199324 unknown
polarizability: 130.5915062|3.5139147|80.3474182|-0.3857745|-0.1677116|64.8518813 unknown
InChI: InChI=1S/C7H13ClO2/c1-2-3-4-5-10-7(9)6-8/h2-6H2,1H3
charge 0 multiplicity 1
23 atoms
Cl 5.029846 -0.206634 -0.03522
O  1.001287 -0.474707 -0.001224
O  2.389793 1.405748 -0.015064
C  -2.743707 0.339556 0.004151
C  -1.435609 -0.487179 0.004036
C  -4.009415 -0.548136 0.007722
C  -0.204186 0.416436 -0.000652
C  -5.315131 0.275114 0.006649
C  2.23956 0.170541 -0.007706
C  3.312964 -0.914422 -0.00087
H  -2.766905 1.002694 -0.885501
H  -2.764443 1.006248 0.89118
H  -1.408705 -1.147278 -0.884051
H  -1.405585 -1.142524 0.895538
H  -3.988936 -1.215183 -0.877866
H  -3.9874 -1.210269 0.896959
H  -0.153203 1.064743 0.893615
H  -0.157148 1.060778 -0.897965
H  -5.373451 0.928075 0.897799
H  -5.375104 0.923046 -0.888058
H  -6.205115 -0.380134 0.009332
H  3.202809 -1.559793 -0.884927
H  3.225486 -1.525121 0.910122
