program: Gaussian 09
title: 000138486
version: EM64L-G09RevD.01
frameworkgroup: C1[X(C9H12BrNO2)]
method: RPBEPBE
basis: SDD
operation: Freq
keyword: #p
keyword: freq=noraman
keyword: PBEPBE/SDD
title: #p freq=noraman PBEPBE/SDD
converged: NO NO NO NO
title: Mulliken charges:
elementType: Br O O N C C C C C C C C C H H H H H H H H H H H H
charge: -0.026624 -0.322525 -0.252047 -0.450121 0.406931 0.038692 0.411177 -0.468036 -0.772810 -0.783529 0.178477 -0.209802 -0.677613 0.339796 0.246370 0.230666 0.246385 0.220978 0.260021 0.259971 0.228055 0.228061 0.214894 0.226317 0.226315
chargesum: 0.00000
title: Mulliken charges with hydrogens summed into heavy atoms:
elementType: Br O O N C C C C C C C C C
charge: -0.026624 -0.322525 -0.252047 -0.110325 0.406931 0.038692 0.411177 -0.468036 -0.049388 -0.042559 0.178477 0.246314 -0.010086
polarizability: 1.99465824e+02 -7.30879237e+00 1.32235428e+02 1.72908706e-02 2.81007391e-03 6.88341040e+01
1716.lowfreq: -88.9497 -0.0006 -0.0004 -0.0002 1.8106 3.9928 8.0115 39.8312 53.4273
frequency: -88.9232 39.3733 53.3151 62.1805 76.3571 93.3562 119.6109 154.3767 163.0580 195.8621 230.4162 251.7341 258.5306 270.8931 330.4597 338.6231 397.8468 454.3654 551.2512 591.7323 616.0348 649.1282 661.9671 723.1436 732.1166 800.6535 802.7693 848.5588 977.1829 1005.0074 1023.8359 1038.9582 1039.0145 1040.2882 1065.4086 1111.2218 1138.5680 1191.9475 1240.7948 1250.6622 1328.0553 1361.5633 1400.9052 1405.4300 1407.1646 1411.1029 1433.5939 1456.5362 1460.1833 1465.7928 1475.1889 1476.1717 1489.0824 1489.5700 1508.1835 1559.6701 1632.9850 2981.2335 2991.0025 2992.6975 3004.3586 3060.4642 3060.7738 3069.9477 3085.4567 3088.9051 3099.4940 3103.3044 3588.9666
redmass: 1.0144 3.5973 1.0357 2.4212 4.5011 7.5174 3.0034 5.3132 3.1171 4.2984 3.4781 1.2932 4.8369 5.0494 4.1228 4.9446 3.7744 6.0476 3.7321 4.4546 6.6941 3.6592 1.2420 8.3571 6.8089 1.0992 4.8110 3.4580 1.6629 2.1711 2.1553 3.6088 1.4604 1.4554 6.8784 2.1908 1.4669 4.6410 1.5262 1.1299 4.4557 1.5026 1.2757 1.2796 1.3054 2.6375 3.1860 1.0427 1.0437 1.0407 1.2055 1.0552 1.1564 1.2642 7.0626 6.3064 10.8623 1.0368 1.0366 1.0357 1.0583 1.1066 1.0980 1.0970 1.0994 1.0984 1.1002 1.1024 1.0810
irintensity: 0.3057 0.0104 0.0814 0.9081 0.0761 0.2141 5.4781 1.1194 0.1486 1.6505 5.5555 0.0605 3.2557 9.5695 0.0000 9.9372 0.7052 0.6401 7.6649 10.8416 1.5211 13.6510 74.1742 9.6724 0.9991 3.6570 43.6962 10.5147 17.2937 110.8419 50.1451 351.8261 0.4719 11.1010 10.3845 1.7075 5.2085 105.1711 241.9161 0.0012 93.4780 2.6891 24.5237 14.7656 5.3517 7.3705 62.3018 15.0466 13.9454 11.8621 13.3614 6.6495 11.2342 26.7206 59.0988 61.7427 395.0314 26.8655 14.7382 23.1983 25.7752 8.0512 12.2618 11.6227 15.5214 33.2196 14.3979 47.4025 93.3636
temp: 298.150 k
press: 1.00000 atm
elementType: 35 8 8 7 6 6 6 6 6 6 6 6 6 1 1 1 1 1 1 1 1 1 1 1 1
symmnumber: 1
zpe: 511274.3 jmol-1
zpe.correction: 0.194734 hartree
zpe.thermalcorrener: 0.208994 hartree
zpe.thermalcorrenthalpy: 0.209938 hartree
zpe.thermalcorrgfe: 0.151525 hartree
zpe.sumelectzpe: -567.849664 hartree
zpe.sumelectthermal: -567.835405 hartree
zpe.sumelectthermalent: -567.834461 hartree
zpe.sumelectthermalfe: -567.892874 hartree
dipole: 1.8466 3.8885 0.0000
dipole: 4.3046
quadrupole: -78.0632 -82.6259 -87.6386
quadrupole: 5.5510 -0.0019 0.0027
quadrupole: 4.7127 0.1500 -4.8627 5.5510 -0.0019 0.0027
hfenergy: -568.0443985 hartree
pointgroup: C01 [X(C9H12Br1N1O2)]
dipole: 0.6465196 1.5653131 -0.0000166 debye
dipolederiv: -0.5451282 -0.0544415 -0.0001846 -0.0720635 -0.0632206 -0.0001383 -0.0002392 -0.0000543 -0.0177969 -1.8541807 -0.3549405 0.0001221 -0.8423995 -0.7202241 0.0000432 0.0005085 0.0001762 -0.2989309 -0.8982027 0.2402187 -0.000112 0.3445909 -1.028885 0.0002908 0.0000862 -0.0001377 -0.315347 -0.3408979 -0.4074093 -0.0000125 -0.5582344 -0.4252722 -0.000113 -0.0000098 -0.0002152 -0.2101432 0.321954 -0.1908532 0.0000201 -0.0564313 0.2927797 0.0000727 0.0000816 -0.0000332 -0.0000552 -1.3780933 0.3240905 -0.0001684 0.3845539 0.0000841 0.0000239 -0.0002852 0.0000117 -0.0743211 -0.1341169 0.2106983 -0.000012 -0.0316154 0.4394787 0.0000883 -0.0003915 0.0006921 0.052314 0.9072179 0.1675618 0.0003799 0.5373204 -0.4024634 0.0001465 0.0003632 0.0000577 -0.2163242 0.1204514 0.0827778 0.0000326 -0.0773577 -0.1254055 -0.0000421 -0.0000519 -0.0000169 0.0501887 -0.0431986 0.0960591 -0.0001664 0.0801565 -0.0210408 0.0000992 0.0003541 -0.0005655 0.0589201 2.5907851 -0.1166744 0.0001436 0.1883311 1.4006858 -0.000384 -0.0001554 -0.0000423 0.2448114 1.137694 0.1396417 -0.0000871 0.0199156 0.2494512 0.0000029 -0.0001612 -0.0000077 0.3566253 -0.0892571 -0.0944724 0.0000115 -0.067499 -0.0421759 0.0000667 0.0001031 0.0000925 0.0687469 0.2796644 0.0004624 -0.0000381 0.0015216 0.2248549 0.0000337 -0.0000424 0.0000325 0.3041128 0.0523101 0.035063 -0.0872752 0.001435 0.0253312 0.0417764 -0.0636151 0.0767427 -0.0220442 -0.0970896 -0.1176288 -0.0001376 -0.0269155 0.0742822 -0.0000203 -0.0001249 -0.0000585 0.1131086 0.0521006 0.0351291 0.0873741 0.0015013 0.0254203 -0.0417396 0.0637773 -0.0766289 -0.0218773 -0.0282202 -0.1578829 0.0004357 -0.0521104 -0.0453031 0.0002471 0.0001893 0.0004645 0.1181725 0.0325785 0.0570349 -0.0937882 0.0523287 0.0304144 -0.0090754 -0.1090228 0.0526601 -0.0210668 0.033127 0.0572232 0.093504 0.0528335 0.029864 0.0086896 0.1087688 -0.0530614 -0.0218466 -0.0815808 -0.03088 -0.0040079 0.0566216 0.0019181 0.0934546 -0.0493263 0.0929694 -0.0631909 -0.0815406 -0.0309329 0.0039781 0.0565675 0.0018567 -0.0934828 0.0492634 -0.0929883 -0.0631531 -0.191791 0.0154264 0.0000725 0.0334884 0.0712057 -0.0000082 0.0000776 0.0000015 0.1148073 0.117688 0.0473865 -0.0609963 -0.0132461 0.0032188 0.0938399 -0.0329322 0.1108698 -0.0678404 0.1177265 0.0473425 0.0609122 -0.0132929 0.003145 -0.0938717 0.0327846 -0.1109609 -0.0678696 unknown
polarizability: 200.040425|-3.8023213|131.6608273|0.0171227|0.0036993|68.834104 unknown
InChI: InChI=1S/C9H12BrNO2/c1-4-13-9(12)8-5(2)7(10)6(3)11-8/h11H,4H2,1-3H3
charge 0 multiplicity 1
25 atoms
Br -4.166344 -0.376902 -0.000295
O  2.252487 0.36637 0.000676
O  1.754256 -1.932717 0.00084
N  -0.337018 1.097963 0.00076
C  -1.224126 -1.011522 0.000441
C  -0.015147 -0.26885 0.000856
C  -1.709554 1.2735 0.00037
C  -2.261253 -0.027947 0.000243
C  -1.358477 -2.508645 0.000252
C  -2.372747 2.618088 0.000388
C  1.360813 -0.736342 0.001062
C  3.700575 0.022782 0.000333
C  4.4736 1.338663 -0.000072
H  0.374248 1.829145 0.000898
H  -0.86529 -2.952563 0.883515
H  -2.420985 -2.803775 -0.000363
H  -0.864259 -2.952436 -0.882494
H  -1.628658 3.433837 -0.001784
H  -3.020888 2.742163 -0.886525
H  -3.017589 2.743927 0.889488
H  3.915914 -0.59213 0.89367
H  3.915434 -0.592397 -0.892935
H  5.559781 1.132375 -0.000338
H  4.23592 1.936624 -0.896913
H  4.236408 1.936888 0.896724
