program: Gaussian 09
title: 000138484
version: EM64L-G09RevD.01
frameworkgroup: C1[X(C8H13N)]
method: RPBEPBE
basis: SDD
operation: Freq
keyword: #pfreq=noraman
keyword: PBEPBE/SDD
title: #p freq=noraman PBEPBE/SDD
converged: YES YES NO NO
title: Mulliken charges:
elementType: N C C C C C C C C H H H H H H H H H H H H H
charge: -0.134088 0.278893 -0.672247 -0.672072 -0.744569 -0.181606 -0.182206 -0.333086 -0.329203 0.207282 0.220104 0.230494 0.220233 0.207244 0.230433 0.225445 0.228455 0.228353 0.246052 0.252080 0.236961 0.237047
chargesum: 0.00000
title: Mulliken charges with hydrogens summed into heavy atoms:
elementType: N C C C C C C C C
charge: -0.134088 0.278893 -0.014368 -0.014162 -0.062315 0.064446 0.069874 -0.096124 -0.092156
polarizability: 1.09669003e+02 -5.05105256e-01 8.99884628e+01 -3.92890522e-03 1.06343830e-03 6.26967606e+01
1716.lowfreq: -8.7817 -5.1416 0.0004 0.0006 0.0009 11.7890 30.4412 127.0920 186.4353
frequency: 29.8176 127.0910 186.4110 224.7229 244.8402 306.1537 321.3321 332.3254 352.6063 433.7032 464.4552 568.7681 610.9914 634.6437 685.1048 716.9577 808.4641 818.0002 863.5684 869.1376 910.9658 923.3554 938.3801 946.5320 1021.1503 1030.2933 1057.1733 1070.7772 1096.9747 1176.3919 1224.0812 1233.5336 1264.1009 1268.4044 1338.0467 1377.4265 1377.4668 1404.9918 1407.4352 1453.3189 1463.4508 1466.1814 1470.8411 1478.1388 1483.2273 1497.3455 1509.1651 2984.7266 2985.9952 2991.2689 3083.0211 3085.3210 3086.0357 3092.2378 3093.5414 3096.0708 3199.7971 3214.0358 3232.6254 3252.5974
redmass: 3.1833 2.4894 1.1373 1.2851 1.8751 1.0449 2.4726 2.4177 2.8012 2.8280 2.8858 2.9345 2.9488 3.1993 1.3262 1.2047 2.7849 1.3299 5.5954 1.3230 1.6975 1.6455 2.5052 1.2013 1.4271 1.3845 1.7350 1.2712 1.2423 2.8441 2.4534 3.0921 2.1611 2.0937 5.1505 1.2024 1.2442 1.2104 4.1263 1.0502 1.0475 1.4262 1.3820 1.3010 1.0537 1.0748 4.1047 1.0349 1.0350 1.0361 1.1001 1.1014 1.1001 1.1001 1.0994 1.0992 1.0884 1.0947 1.1032 1.1060
irintensity: 0.0003 0.4120 0.0006 0.0159 0.0229 0.0080 0.3672 1.0438 1.0437 0.7786 0.6829 1.5494 0.1146 19.3927 1.7018 157.1513 0.0514 0.0097 0.0134 0.0019 1.0733 1.7544 14.7841 0.0485 1.4411 0.4089 15.6209 25.3057 37.1755 7.6034 5.9999 21.3306 80.6401 49.2439 2.1533 24.8897 33.1972 11.5073 0.2438 0.0105 0.4204 13.3836 9.8402 19.7263 10.2699 18.3336 0.6297 22.8199 24.6904 12.9565 2.0882 2.4344 13.2931 40.8439 44.6130 79.7287 3.9041 8.0407 5.7923 1.4989
temp: 298.150 k
press: 1.00000 atm
elementType: 7 6 6 6 6 6 6 6 6 1 1 1 1 1 1 1 1 1 1 1 1 1
symmnumber: 1
zpe: 501746.8 jmol-1
zpe.correction: 0.191105 hartree
zpe.thermalcorrener: 0.200646 hartree
zpe.thermalcorrenthalpy: 0.201590 hartree
zpe.thermalcorrgfe: 0.156681 hartree
zpe.sumelectzpe: -366.689658 hartree
zpe.sumelectthermal: -366.680118 hartree
zpe.sumelectthermalent: -366.679173 hartree
zpe.sumelectthermalfe: -366.724083 hartree
dipole: 2.6274 0.0622 0.0001
dipole: 2.6282
quadrupole: -54.6736 -52.0468 -59.3446
quadrupole: 0.1804 -0.0017 -0.0004
quadrupole: 0.6814 3.3082 -3.9896 0.1804 -0.0017 -0.0004
hfenergy: -366.8807634 hartree
pointgroup: C01 [X(C8H13N1)]
dipole: -1.0338923 0.014654 0.0003592 debye
dipolederiv: -0.96982 -0.0351639 0.0002574 -0.0071639 -0.0908145 0.0002471 0.0013131 0.0002455 -0.1977163 0.8609373 0.0397787 0.0001721 0.0042118 0.2280312 -0.0002695 -0.0004195 -0.0002871 0.3528911 -0.0557622 -0.014198 0.0067393 -0.0328083 -0.0130329 0.0630856 0.0317456 0.0609318 -0.077212 -0.055978 -0.0140477 -0.0068508 -0.0325593 -0.0120745 -0.0625831 -0.0319979 -0.0604022 -0.0784253 -0.0616952 0.0418315 0.0001597 0.0635767 -0.0877378 -0.0006117 0.0003344 -0.0006007 0.0365256 0.2948047 -0.0601704 -0.0003694 -0.2760729 -0.1231353 0.0002121 -0.001236 0.0000829 -0.19952 0.3369502 0.0975124 -0.0000726 0.3032767 -0.0897911 0.0003354 0.0000371 0.0004361 -0.2154396 -0.1775468 -0.0227793 -0.0001926 -0.0508124 0.0238718 0.0006726 -0.0001675 0.0006892 -0.2634189 -0.2133775 0.0070394 -0.000087 0.0579221 0.0304119 0.0007484 0.000184 0.0007532 -0.2615191 -0.2051924 -0.0241684 0.0265705 -0.0049552 0.0990342 0.008664 0.004663 0.0100195 0.0807978 0.0844381 0.0994542 -0.0019065 0.0735722 -0.1217972 0.030543 0.0081467 -0.0155072 0.0712929 0.086399 -0.0390042 -0.0675055 -0.0353392 0.0293629 -0.105385 -0.0476576 -0.0605796 -0.089575 0.0842843 0.0994795 0.0027647 0.0736819 -0.1214338 -0.032368 -0.0074433 0.0137663 0.0711821 -0.2052772 -0.02408 -0.0266983 -0.0051987 0.0991654 -0.0085517 -0.0048114 -0.0098684 0.0806026 0.0864229 -0.0396586 0.0670541 -0.0356933 0.0277697 0.106591 0.0472526 0.0616218 -0.0880523 -0.1741662 0.0156598 0.0001566 -0.0449667 0.0981215 -0.0000027 -0.0000905 -0.0000412 0.1028429 0.0955187 -0.0564608 -0.0715447 -0.0214055 0.0044187 -0.0826694 -0.0632943 -0.1027408 -0.0701302 0.0956469 -0.0570913 0.0709998 -0.0219386 0.0027666 0.0833176 0.0630418 0.1034075 -0.0686301 0.055602 -0.0939542 -0.0001637 -0.0692669 -0.0165471 -0.0004904 -0.0001071 -0.0004603 0.2055461 0.0811935 0.0792529 0.0003034 0.0598967 -0.016046 -0.0006045 0.0002876 -0.0005708 0.1986402 -0.0215141 0.0988683 0.0003462 0.102415 0.0233994 -0.0004847 0.0003764 -0.0004468 0.2010836 -0.0218679 -0.0981 -0.0001325 -0.1003721 0.0260569 -0.0003963 -0.0001573 -0.0004489 0.2082338 unknown
polarizability: 109.6576509|0.6915992|89.9996492|-0.0185751|0.06547|62.6969259 unknown
InChI: InChI=1S/C8H13N/c1-8(2,3)9-6-4-5-7-9/h4-7H,1-3H3
charge 0 multiplicity 1
22 atoms
N  0.169716 0.027942 0.000521
C  -1.332357 -0.008332 0.000369
C  -1.815961 -0.756277 1.272265
C  -1.815889 -0.744942 -1.278181
C  -1.896127 1.430977 0.0068
C  0.986483 -1.110247 -0.002915
C  0.993462 1.161036 0.002762
C  2.325223 -0.699145 -0.002591
C  2.329624 0.739154 0.000864
H  -2.920181 -0.792013 1.296592
H  -1.439469 -1.793735 1.295358
H  -1.458783 -0.242833 2.182222
H  -1.438509 -1.781807 -1.310799
H  -2.920098 -0.781192 -1.302618
H  -1.459263 -0.222916 -2.183468
H  -2.998832 1.382571 0.006976
H  -1.580004 1.987077 0.907237
H  -1.580815 1.994923 -0.889033
H  0.566883 -2.11414 -0.005195
H  0.58617 2.167988 0.005608
H  3.191844 -1.359081 -0.004613
H  3.200383 1.393493 0.002039
