program: Gaussian 09
title: 000138483
version: EM64L-G09RevD.01
frameworkgroup: C1[X(C6H12N2)]
method: RPBEPBE
basis: SDD
operation: Freq
keyword: #pfreq=noraman
keyword: PBEPBE/SDD
title: #p freq=noraman PBEPBE/SDD
converged: YES YES NO NO
title: Mulliken charges:
elementType: N N C C C C C C H H H H H H H H H H H H
charge: -0.070361 -0.070363 -0.374942 -0.374923 -0.374924 -0.374941 -0.450341 -0.450340 0.172417 0.237174 0.237174 0.172372 0.237174 0.172373 0.172415 0.237174 0.236824 0.214607 0.214607 0.236823
chargesum: 0.00000
title: Mulliken charges with hydrogens summed into heavy atoms:
elementType: N N C C C C C C
charge: -0.070361 -0.070363 0.034649 0.034622 0.034623 0.034649 0.001090 0.001091
polarizability: 8.61602864e+01 5.39661530e-04 7.63104452e+01 -1.15838780e-04 -4.57887178e-04 6.08039887e+01
1716.lowfreq: -32.5930 -26.9797 -16.3803 -0.0010 -0.0007 -0.0004 43.2525 195.9660 256.0340
frequency: 40.3846 195.9660 256.0054 355.3689 355.8913 470.5704 530.0279 582.2807 587.4903 647.9600 810.2213 845.4472 889.1091 894.5977 926.1630 931.6623 935.9903 987.1510 1031.8136 1056.9871 1090.5652 1114.6577 1115.3957 1131.5625 1146.9661 1155.0879 1179.8518 1205.5929 1209.8202 1224.6402 1293.7851 1300.5728 1309.4152 1310.1669 1324.7612 1354.6615 1457.1146 1457.2550 1473.2085 1478.2180 1483.8861 1498.9718 2850.0991 2854.1949 2859.1096 2867.9724 3023.9742 3024.3650 3040.9375 3043.2946 3048.0250 3051.7661 3097.8285 3097.9354
redmass: 2.2703 2.0557 1.6883 2.6100 2.2158 4.2649 2.7890 4.6608 1.7597 4.0712 1.8917 2.6174 1.3695 2.0434 2.4036 1.4896 2.3922 1.7652 1.9489 4.5159 1.5121 1.1420 6.5350 1.7015 1.8745 1.2586 2.4437 1.2900 1.5649 1.2875 1.3260 1.3055 1.3819 1.2987 1.2652 1.4320 1.0949 1.0941 1.0811 1.0946 1.0909 1.0900 1.0700 1.0734 1.0729 1.0699 1.0638 1.0633 1.0888 1.0883 1.0871 1.0874 1.1057 1.1061
irintensity: 0.0000 2.1043 3.0769 3.8709 11.7520 0.0257 4.6408 0.0000 0.1240 8.6954 0.2657 4.0262 0.0000 3.1693 2.0918 0.5746 0.1297 0.0000 10.1680 8.7146 0.3447 0.0000 47.3593 4.7651 0.0000 1.7779 0.0000 7.4294 2.6080 0.3076 0.0000 7.6675 14.2729 0.0003 2.4454 0.1030 21.0024 2.7855 0.0000 5.3266 0.9617 8.3551 66.2487 0.0425 27.5760 302.9083 24.6121 0.1914 0.0006 97.1315 87.9875 17.2209 62.8779 6.9404
temp: 298.150 k
press: 1.00000 atm
elementType: 7 7 6 6 6 6 6 6 1 1 1 1 1 1 1 1 1 1 1 1
symmnumber: 1
zpe: 463593.3 jmol-1
zpe.correction: 0.176573 hartree
zpe.thermalcorrener: 0.183734 hartree
zpe.thermalcorrenthalpy: 0.184678 hartree
zpe.thermalcorrgfe: 0.144810 hartree
zpe.sumelectzpe: -344.627829 hartree
zpe.sumelectthermal: -344.620668 hartree
zpe.sumelectthermalent: -344.619724 hartree
zpe.sumelectthermalfe: -344.659592 hartree
dipole: 0.0000 0.0001 2.3947
dipole: 2.3947
quadrupole: -44.4065 -48.5232 -53.0170
quadrupole: 0.0020 -0.0001 -0.0001
quadrupole: 4.2424 0.1257 -4.3681 0.0020 -0.0001 -0.0001
hfenergy: -344.8044023 hartree
pointgroup: C01 [X(C6H12N2)]
dipole: 0.0000102 0.0000297 0.9421646 debye
dipolederiv: -0.4659639 -0.0003297 0.0001159 0.0000788 -0.1178425 0.0540026 -0.0005265 -0.2247559 -0.386551 -0.4659602 -0.0003231 -0.0001112 0.0000723 -0.1178283 -0.0540194 0.0005281 0.2247367 -0.3865578 0.2732776 0.1375238 0.052381 0.1375238 0.1033226 -0.0276337 0.0734277 0.0793181 0.3914117 0.2729627 -0.1370745 -0.0527406 -0.1373046 0.102884 -0.0277308 -0.0734088 0.0791825 0.3918584 0.2729575 -0.1370714 0.0527462 -0.1373026 0.1028793 0.0277481 0.0734142 -0.0791641 0.3918523 0.2732773 0.1375159 -0.0523912 0.1375137 0.1033189 0.0276528 -0.0734352 -0.0792965 0.3914191 0.0316413 -0.0000748 0.0278872 -0.0001933 -0.0036302 0.00013 -0.0271065 0.0002262 0.1669183 0.0316426 -0.0000776 -0.0278906 -0.0001945 -0.0036277 -0.0001187 0.0271025 -0.0002158 0.1669145 -0.0355275 0.0004412 0.0657653 -0.0182987 0.0244488 -0.0315731 -0.0765014 -0.1134292 -0.268442 0.0090648 -0.0850678 0.0138462 -0.1139232 -0.133236 0.0463961 0.0112385 0.0677218 0.0405662 0.0094353 0.0849485 -0.0136438 0.1138056 -0.1335547 0.0460947 -0.010908 0.0673617 0.0407802 -0.0356882 -0.0004328 -0.0659113 0.0181742 0.0246347 -0.0311528 0.0764505 -0.1130151 -0.2689484 0.0094349 0.0849484 0.013641 0.1138056 -0.1335563 -0.0460851 0.0109045 -0.0673549 0.0407843 -0.0356861 -0.0004272 0.0659072 0.0181712 0.0246422 0.0311377 -0.0764539 0.1130015 -0.2689496 -0.0355292 0.0004377 -0.0657677 -0.0182924 0.0244595 0.0315503 0.0765 0.1134056 -0.2684564 0.0090678 -0.0850669 -0.013838 -0.1139223 -0.1332457 -0.046383 -0.0112277 -0.0677072 0.0405762 0.0529006 0.0000668 0.0548865 0.0001423 0.0442148 -0.0001492 0.1237688 -0.00016 -0.1093126 -0.1121027 -0.0000033 -0.0881888 -0.0000016 0.0887511 -0.000037 -0.1499308 -0.0000247 0.0017237 -0.1121098 0.0000032 0.0881911 0.0000107 0.0887503 0.0000306 0.1499299 0.000019 0.0017297 0.0529053 0.0000636 -0.0548844 0.0001351 0.0442153 0.0001398 -0.1237659 0.0001505 -0.1093169 unknown
polarizability: 86.1602864|0.0004282|76.3104451|-0.0001158|-0.0004579|60.8039887 unknown
InChI: InChI=1S/C6H12N2/c1-3-7-5-2-6-8(7)4-1/h1-6H2
charge 0 multiplicity 1
20 atoms
N  0.000011 0.7784 -0.448192
N  -0.00003 -0.778429 -0.448144
C  1.265584 1.198744 0.221813
C  -1.264588 1.198777 0.223561
C  1.264577 -1.198773 0.223619
C  -1.265598 -1.198727 0.221905
C  2.213942 -0.000618 -0.003309
C  -2.21395 0.000617 -0.003304
H  1.127975 1.375562 1.318566
H  1.644884 2.129337 -0.234815
H  -1.643304 2.130553 -0.23114
H  -1.126159 1.373495 1.32058
H  1.643291 -2.130561 -0.231057
H  1.126159 -1.373439 1.320646
H  -1.127978 -1.375455 1.318673
H  -1.644893 -2.129362 -0.234642
H  2.590585 -0.001622 -1.040514
H  3.070515 -0.000426 0.691445
H  -3.070544 0.000474 0.691426
H  -2.590577 0.001557 -1.040517
