program: Gaussian 09
title: 000011454
version: EM64L-G09RevD.01
frameworkgroup: C1[X(C8H9Br)]
method: RPBEPBE
basis: SDD
operation: Freq
keyword: #pfreq=noraman
keyword: PBEPBE/SDD
title: #p freq=noraman PBEPBE/SDD
converged: YES YES NO NO
title: Mulliken charges:
elementType: Br C C C C C C C C H H H H H H H H H
charge: -0.070400 -0.596389 0.566748 -0.396212 -0.335914 -0.645565 -0.219211 -0.231626 -0.233956 0.290864 0.232562 0.230633 0.230596 0.238646 0.247003 0.230729 0.229140 0.232352
chargesum: 0.00000
title: Mulliken charges with hydrogens summed into heavy atoms:
elementType: Br C C C C C C C C
charge: -0.070400 -0.305525 0.566748 -0.163650 -0.105281 0.070680 0.011518 -0.002485 -0.001604
polarizability: 1.37784371e+02 2.27486772e+00 8.15012018e+01 5.71849137e-01 -8.30004888e+00 8.20986586e+01
1716.lowfreq: -19.0263 -7.1394 -0.0004 0.0005 0.0006 5.8361 28.4895 85.2170 203.6822
frequency: 28.0597 85.2108 203.6671 219.6554 248.5225 262.9658 376.4658 400.6311 483.8887 547.4411 570.9564 616.6397 697.6958 767.2303 777.2777 847.3946 923.9016 968.6596 976.4832 990.3364 998.1934 1022.3490 1043.3114 1056.7762 1102.7168 1172.9808 1177.5996 1189.4654 1219.9689 1303.0961 1348.4256 1388.7554 1393.1887 1444.2021 1458.8156 1475.0999 1484.5678 1592.0072 1610.8650 2985.5943 3072.6685 3084.2486 3112.2924 3120.5372 3128.8444 3140.4018 3151.7618 3166.8885
redmass: 3.8973 6.5504 3.4916 4.3459 1.5785 1.5925 4.1652 2.7666 3.7424 3.7998 3.2373 6.2677 1.6668 3.7791 1.9349 1.2542 1.4410 1.5672 1.4112 5.1650 1.3413 2.1894 1.4492 2.3099 1.7309 1.0990 1.1483 1.1113 2.0452 1.6072 1.4596 4.4269 1.2891 2.1302 1.0639 1.0817 2.1347 5.9481 6.0671 1.0390 1.0895 1.0935 1.0999 1.0873 1.0863 1.0914 1.0962 1.1016
irintensity: 0.2321 1.5427 0.8606 1.6968 3.1694 2.5020 9.3311 0.1164 20.9577 34.2074 38.1577 1.5675 56.3746 2.2730 39.0810 0.2654 2.6308 13.2000 0.9726 0.7368 0.0531 13.5299 17.8957 6.1138 16.8854 10.8222 27.8619 1.1135 29.0086 15.9813 6.2728 1.9249 17.1241 11.8799 9.5698 11.2599 4.4986 0.5622 0.7500 15.2394 1.6380 18.8717 23.8912 8.4676 0.5146 11.8195 38.1894 19.7963
temp: 298.150 k
press: 1.00000 atm
elementType: 35 6 6 6 6 6 6 6 6 1 1 1 1 1 1 1 1 1
symmnumber: 1
zpe: 379447.7 jmol-1
zpe.correction: 0.144524 hartree
zpe.thermalcorrener: 0.153255 hartree
zpe.thermalcorrenthalpy: 0.154199 hartree
zpe.thermalcorrgfe: 0.108854 hartree
zpe.sumelectzpe: -323.055692 hartree
zpe.sumelectthermal: -323.046961 hartree
zpe.sumelectthermalent: -323.046017 hartree
zpe.sumelectthermalfe: -323.091361 hartree
dipole: -2.2491 1.5223 1.1707
dipole: 2.9574
quadrupole: -61.6491 -61.8261 -59.5607
quadrupole: 4.3027 2.9435 -3.1357
quadrupole: -0.6372 -0.8141 1.4513 4.3027 2.9435 -3.1357
hfenergy: -323.2002155 hartree
pointgroup: C01 [X(C8H9Br1)]
dipole: -0.6726083 -0.421144 -0.8508912 debye
dipolederiv: -0.5892818 -0.121825 -0.1977665 -0.1703958 -0.2644756 -0.1582201 -0.4600752 -0.2368196 -0.5399502 0.9237583 0.1707831 0.2959433 0.2155335 0.3065798 0.2864016 0.4454298 0.3422803 0.7620479 -0.1534725 -0.0118453 0.0071352 0.0649473 -0.0674952 -0.0342944 0.1159478 -0.0387842 -0.1322748 -0.0520455 0.0848537 -0.0566585 -0.0447591 0.0274218 -0.1030549 -0.0404543 -0.0693985 -0.1007783 -0.0176354 -0.0920509 0.03185 -0.0140678 0.0002621 -0.0268436 0.0107016 -0.0658707 -0.1034718 -0.1161639 0.004757 -0.0530946 0.0475736 -0.0801476 -0.070612 -0.0157147 -0.1490416 -0.1004956 -0.0291668 -0.1155585 0.0423799 -0.1294611 0.0131136 -0.0721499 0.0718675 -0.0549092 -0.0954086 -0.0933864 0.0734479 -0.0654809 0.1231831 0.0556616 -0.0855168 -0.0497914 -0.1024757 -0.0929213 0.0858916 -0.0004684 -0.0391101 -0.0062314 -0.0571758 -0.0527264 -0.0220674 -0.0461585 -0.1269068 0.0055016 0.0203103 -0.0542383 -0.0428167 -0.0544429 0.0256601 -0.026372 0.0337572 -0.0935479 0.0462089 -0.0839151 0.0556542 -0.0647488 -0.024385 0.0747833 0.0300053 0.0793313 0.0966741 0.0293181 0.0997336 -0.0354376 0.083069 0.0018311 0.0501789 -0.0540145 0.0509409 0.1128739 0.0834136 -0.0000997 -0.0681876 -0.0244164 0.0333178 -0.1044339 -0.0845213 -0.0730175 -0.083748 0.1153876 -0.0371143 0.0501292 -0.0139704 -0.0223163 0.0749144 0.012862 0.125244 0.0134101 -0.1460608 -0.0057841 0.058674 -0.0353249 0.0855052 0.0002239 0.0265158 0.0043822 0.108695 -0.0032972 0.0898064 -0.0338625 0.1071946 -0.0140457 0.0756327 -0.0322355 0.074734 0.1258686 0.0384336 -0.0620129 0.0347593 -0.0794475 -0.0398362 0.0936241 0.0473131 0.0988135 0.1077234 -0.127403 -0.0130177 0.0273116 -0.0158611 0.1006274 0.026433 0.0246034 0.0269921 0.1422102 unknown
polarizability: 135.000018|5.4446965|88.8671119|12.1213158|-3.9713149|77.5171012 unknown
InChI: InChI=1S/C8H9Br/c1-7(9)8-5-3-2-4-6-8/h2-7H,1H3
charge 0 multiplicity 1
18 atoms
Br 2.663459 0.809889 1.399802
C  1.752804 0.192835 -0.388114
C  0.267469 0.067555 -0.165853
C  -0.58657 1.125816 -0.573661
C  -0.309501 -1.08644 0.427847
C  2.490161 -1.061584 -0.862837
C  -1.985232 1.031549 -0.404504
C  -1.706131 -1.180869 0.600896
C  -2.549666 -0.123584 0.183525
H  1.980376 1.055912 -1.033633
H  -0.150819 2.02735 -1.021941
H  0.334312 -1.904416 0.769295
H  2.060897 -1.39197 -1.82896
H  2.396549 -1.892429 -0.144046
H  3.563239 -0.854531 -1.006536
H  -2.631003 1.855506 -0.727342
H  -2.138468 -2.074953 1.063592
H  -3.634276 -0.198635 0.31927
