program: Gaussian 09
title: 000138478
version: EM64L-G09RevD.01
frameworkgroup: C1[X(C15H16O)]
method: RPBEPBE
basis: SDD
operation: Freq
keyword: #pfreq=noraman
keyword: PBEPBE/SDD
title: #p freq=noraman PBEPBE/SDD
converged: YES YES NO NO
title: Mulliken charges:
elementType: O C C C C C C C C C C C C C C C H H H H H H H H H H H H H H H H
charge: -0.467007 -0.036707 -0.565073 -0.589745 0.476590 0.455122 -0.380835 -0.403018 -0.456921 -0.433562 -0.230537 -0.226982 -0.221443 -0.230349 -0.247873 -0.238499 0.222000 0.230610 0.200013 0.220297 0.212152 0.282618 0.234577 0.225703 0.259648 0.356089 0.221638 0.226615 0.221471 0.228250 0.224846 0.230315
chargesum: 0.00000
title: Mulliken charges with hydrogens summed into heavy atoms:
elementType: O C C C C C C C C C C C C C C C
charge: -0.110919 0.185293 -0.134450 -0.157297 0.476590 0.455122 -0.098217 -0.168442 -0.231218 -0.173914 -0.008899 -0.000368 0.000028 -0.002099 -0.023027 -0.008184
polarizability: 2.08591776e+02 1.61158825e+01 1.48565196e+02 9.07961976e-01 3.01883142e+00 1.17848253e+02
1716.lowfreq: -5.6084 -0.0003 -0.0002 0.0004 5.6142 10.8597 25.1755 34.3845 48.2607
frequency: 20.4448 31.9180 48.2541 61.7030 81.4995 117.3270 212.6840 233.3481 273.3529 290.8172 338.5954 359.6299 405.8039 407.5503 430.9591 434.2232 493.2318 500.7448 590.6294 594.8523 617.8204 618.6856 705.6691 706.7537 748.1281 760.4427 790.3141 821.2590 834.3337 855.7793 857.5132 879.1772 920.5213 923.1353 976.7484 978.7234 988.8264 989.7388 995.3504 995.8538 1003.3602 1019.9427 1027.6554 1028.7438 1030.5243 1082.0089 1086.4477 1154.5966 1170.1838 1173.2037 1188.0972 1188.5364 1198.3715 1212.1251 1218.5610 1250.8038 1255.2073 1314.3616 1324.3708 1330.5757 1345.4768 1372.7523 1382.1395 1384.3772 1439.0970 1441.4430 1448.8266 1460.6763 1482.6632 1483.5447 1590.9051 1591.3957 1612.8497 1614.1664 2955.5686 2983.5607 2990.1904 3043.0124 3054.4319 3109.5111 3116.8531 3121.2524 3122.1721 3134.9191 3135.6794 3145.8389 3153.4359 3163.8279 3166.1446 3528.6909
redmass: 3.7009 4.6775 4.4541 4.9116 3.5151 4.6986 5.3062 3.8452 4.2936 3.4233 2.5547 1.1475 2.8175 2.6299 2.1873 2.5624 3.0181 4.2778 3.1776 5.1731 6.1381 6.2313 1.9169 1.7905 1.6725 2.1982 3.3181 3.4444 3.8003 1.2528 1.2474 1.6952 1.4581 1.4453 1.3919 1.3965 6.1178 4.5375 1.3581 1.4172 2.0228 2.4509 2.4237 2.2561 2.8359 1.6743 1.5818 1.1356 1.0547 1.0529 1.1218 1.1295 1.1639 2.3430 2.2975 1.4120 1.2024 1.4164 1.2980 1.2502 1.3493 1.7425 6.0488 5.1691 1.8778 2.1252 1.2031 1.1253 2.3012 2.3176 6.0381 6.0054 6.1422 6.1019 1.0841 1.0602 1.0599 1.1009 1.1022 1.0868 1.0870 1.0866 1.0868 1.0912 1.0930 1.0960 1.0970 1.1015 1.0984 1.0655
irintensity: 0.0622 0.0783 0.2112 0.8233 1.9085 1.3180 0.1782 1.0728 2.8969 1.0810 0.3584 165.5810 1.4682 9.2772 14.5106 8.0832 16.8561 17.3549 13.4467 3.9438 0.9598 0.1029 44.3655 48.4936 64.9166 30.7019 5.3334 14.1554 1.9618 0.5530 0.2845 4.6337 0.2143 3.9661 0.3226 0.4781 0.0890 0.1027 0.7423 0.8999 7.6355 2.7229 19.0068 10.7093 28.0493 8.3984 25.2125 3.2424 0.1574 0.1086 0.2513 1.4182 13.8059 0.3865 0.2218 8.6423 25.1229 10.9206 1.3820 2.8774 8.0475 26.2289 1.6086 1.0303 1.6297 10.8177 3.1280 17.8480 38.2765 9.2813 0.2887 2.4496 12.0549 8.7971 23.4766 12.6091 49.2893 7.5564 30.7871 10.7557 7.9791 2.9494 1.5023 10.8226 38.0826 37.8847 30.2349 23.0154 12.7169 3.7897
temp: 298.150 k
press: 1.00000 atm
elementType: 8 6 6 6 6 6 6 6 6 6 6 6 6 6 6 6 1 1 1 1 1 1 1 1 1 1 1 1 1 1 1 1
symmnumber: 1
zpe: 698173.1 jmol-1
zpe.correction: 0.265920 hartree
zpe.thermalcorrener: 0.280202 hartree
zpe.thermalcorrenthalpy: 0.281146 hartree
zpe.thermalcorrgfe: 0.222367 hartree
zpe.sumelectzpe: -655.265120 hartree
zpe.sumelectthermal: -655.250839 hartree
zpe.sumelectthermalent: -655.249895 hartree
zpe.sumelectthermalfe: -655.308673 hartree
dipole: 1.7563 -1.1095 -0.4618
dipole: 2.1281
quadrupole: -90.5282 -89.1541 -94.5072
quadrupole: 4.9431 -0.7657 -0.4249
quadrupole: 0.8683 2.2424 -3.1107 4.9431 -0.7657 -0.4249
hfenergy: -655.5310404 hartree
pointgroup: C01 [X(C15H16O1)]
dipole: 0.7077939 -0.4310065 0.1193734 debye
polarizability: 207.2891383|15.0326255|140.3000189|-10.5175347|-14.9790323|127.4160671 unknown
InChI: InChI=1S/C15H16O/c16-15(11-13-7-3-1-4-8-13)12-14-9-5-2-6-10-14/h1-10,15-16H,11-12H2
charge 0 multiplicity 1
32 atoms
O  0.110425 1.306817 -0.562949
C  0.022085 0.217132 0.429055
C  -1.271443 0.467002 1.234275
C  1.281652 0.206158 1.347961
C  -2.557076 0.106511 0.499623
C  2.567305 0.046121 0.552923
C  -2.916873 0.758542 -0.710383
C  3.069417 -1.244033 0.23628
C  -3.427469 -0.886505 1.018442
C  3.260582 1.182414 0.055066
C  -4.113179 0.420771 -1.380665
C  4.230127 -1.397273 -0.554021
C  -4.626606 -1.225632 0.349167
C  4.423674 1.03239 -0.735915
C  -4.97408 -0.571604 -0.854505
C  4.91088 -0.258211 -1.04516
H  -0.043431 -0.760621 -0.096714
H  -1.268714 1.540592 1.509138
H  -1.212054 -0.111072 2.176107
H  1.293639 1.153344 1.920362
H  1.170567 -0.62406 2.071842
H  -2.241798 1.516965 -1.118975
H  2.54973 -2.132107 0.617615
H  -3.165578 -1.396564 1.954621
H  2.896871 2.185415 0.30848
H  0.927814 1.170247 -1.109372
H  -4.376479 0.933126 -2.31347
H  4.605804 -2.400869 -0.783639
H  -5.286817 -1.99461 0.766995
H  4.948859 1.919946 -1.106873
H  -5.903559 -0.830151 -1.374649
H  5.812825 -0.37578 -1.656061
