program: Gaussian 09
title: 000138477
version: EM64L-G09RevD.01
frameworkgroup: C1[X(C7H6N4)]
method: RPBEPBE
basis: SDD
operation: Freq
keyword: #p
keyword: freq=noraman
keyword: PBEPBE/SDD
title: #p freq=noraman PBEPBE/SDD
converged: NO NO NO NO
title: Mulliken charges:
elementType: N N N N C C C C C C C H H H H H H
charge: -0.244026 -0.041020 -0.105778 -0.090734 0.465214 -0.341023 -0.351919 -0.211058 -0.197479 -0.237504 -0.160218 0.230150 0.292455 0.236075 0.239288 0.239415 0.278161
chargesum: 0.00000
title: Mulliken charges with hydrogens summed into heavy atoms:
elementType: N N N N C C C C C C C
charge: -0.244026 -0.041020 -0.105778 -0.090734 0.465214 -0.110873 -0.059463 0.025017 0.041809 0.001911 0.117943
polarizability: 1.53020992e+02 -6.63203146e-01 1.02197855e+02 -4.30288564e-03 8.39938025e-04 3.94368401e+01
1716.lowfreq: -32.3157 -13.4399 -0.0009 -0.0009 -0.0008 2.5125 6.7620 112.6474 174.5640
frequency: -30.6056 112.6213 174.5548 276.6921 351.5945 400.9288 431.4193 506.3713 611.7859 646.0737 669.8346 678.0261 693.2021 770.6779 793.1908 841.8955 846.8582 914.1531 926.8844 978.0792 981.2676 987.7222 999.4246 1003.8927 1030.2266 1081.1384 1102.3140 1146.0475 1177.3824 1194.2967 1198.6775 1321.1330 1344.1035 1388.0540 1394.0525 1453.9731 1490.9253 1601.8138 1611.8973 3139.0032 3147.6243 3159.5186 3173.5489 3188.0592 3277.7448
redmass: 4.7405 6.1895 5.6184 5.3301 7.9575 2.8311 5.7316 3.3195 6.4651 2.8779 12.0061 6.4813 2.0978 1.6849 1.5676 1.2559 7.5829 8.6050 1.4072 9.4004 1.3724 6.4701 10.0220 1.3266 2.0586 1.6313 5.8435 1.9250 1.0648 1.1279 3.2289 1.7922 2.3141 6.1786 5.3138 2.3860 2.5745 6.7719 6.0682 1.0855 1.0892 1.0944 1.0991 1.0971 1.1001
irintensity: 3.5808 1.3256 4.5878 1.6027 0.7885 0.0034 1.0883 15.6297 0.1785 0.1070 2.1690 6.6706 38.8283 81.3178 30.5070 0.0090 5.0641 72.4820 7.6327 1.0410 0.3777 1.1922 6.8152 1.0800 6.2660 6.6867 11.3373 38.0216 0.3825 1.1993 6.4795 3.9528 2.7865 12.9521 11.9188 7.9713 74.1124 4.1144 14.4047 1.4165 5.8690 23.5338 12.1547 2.8700 2.2599
temp: 298.150 k
press: 1.00000 atm
elementType: 7 7 7 7 6 6 6 6 6 6 6 1 1 1 1 1 1
symmnumber: 1
zpe: 324299.8 jmol-1
zpe.correction: 0.123519 hartree
zpe.thermalcorrener: 0.130736 hartree
zpe.thermalcorrenthalpy: 0.131681 hartree
zpe.thermalcorrgfe: 0.091161 hartree
zpe.sumelectzpe: -488.521405 hartree
zpe.sumelectthermal: -488.514188 hartree
zpe.sumelectthermalent: -488.513244 hartree
zpe.sumelectthermalfe: -488.553763 hartree
dipole: 6.1303 2.4340 0.0039
dipole: 6.5958
quadrupole: -75.6156 -56.8786 -66.3557
quadrupole: -4.0603 -0.0062 -0.0074
quadrupole: -9.3323 9.4047 -0.0724 -4.0603 -0.0062 -0.0074
hfenergy: -488.6449242 hartree
pointgroup: C01 [X(C7H6N4)]
dipole: -2.4077911 0.9677147 -0.0018417 debye
dipolederiv: -0.7826381 0.0704769 -0.0000335 0.1722136 -0.1745848 -0.0000656 -0.0003323 0.000205 0.0802255 0.2902056 -0.2865027 0.0002959 -0.4763349 -0.0849072 -0.0005185 0.0000039 0.0001058 -0.0903656 -0.442821 0.1036005 0.000273 0.255672 -0.3047876 0.0003491 -0.0004444 -0.0000755 -0.1739073 -0.4420093 0.0270162 -0.0006073 -0.2666562 0.2027019 0.0000812 0.0005447 -0.0003634 -0.1742153 0.8628158 -0.0040537 0.0000296 0.0446193 0.0791947 0.0003356 0.0001721 0.0001274 0.0731163 -0.1415987 0.0522018 0.0001182 0.0575386 -0.0124275 0.0002078 -0.0000439 0.0001859 -0.1536524 -0.1653042 -0.0687938 -0.0000032 -0.0912977 -0.041586 0.0000904 0.0001502 -0.0000531 -0.1327005 -0.0270638 -0.0765325 -0.0000099 -0.1440792 0.0964051 0.0001788 -0.0001498 0.0001659 -0.1413249 0.0130799 0.0957363 0.0000669 0.126302 0.1279963 0.0002205 0.000132 0.0001959 -0.1399439 0.0671736 -0.00019 0.0000428 0.0324165 -0.0809939 0.0000175 0.0000692 0.0000518 -0.151909 0.5314514 0.0593189 0.0001193 0.2603342 0.0865822 -0.0003268 -0.0000116 -0.0000221 -0.0290749 0.0404913 -0.1021836 -0.0001222 -0.091715 -0.0221409 -0.0002206 -0.0001647 -0.0001774 0.1663896 0.1074626 0.0599846 0.0000548 0.0578529 0.0548765 -0.0001452 0.0001632 -0.000054 0.1755225 0.027261 0.0746974 0.0000366 0.0936214 -0.0497816 -0.0001615 0.0000624 -0.0001499 0.1598929 0.0338813 -0.0718538 -0.0000753 -0.089335 -0.0516941 -0.0001728 -0.0000951 -0.0001611 0.1576984 -0.108509 -0.0041401 -0.0000452 -0.0026867 0.0961155 -0.000064 -0.0000469 -0.0000358 0.166984 0.1361218 0.0712177 -0.0001406 0.0615344 0.0790313 0.0001943 -0.0000089 0.0000547 0.2072645 unknown
polarizability: 153.0256587|0.4500438|102.1931859|0.0153235|0.0052255|39.4368424 unknown
InChI: InChI=1S/C7H6N4/c1-2-4-7(5-3-1)11-6-8-9-10-11/h1-6H
charge 0 multiplicity 1
17 atoms
N  1.022499 0.062295 -0.00001
N  1.762855 -1.1433 0.00214
N  3.183821 0.630607 0.000307
N  3.059173 -0.782978 0.000573
C  -0.414647 0.043905 -0.000244
C  -1.140485 1.258623 0.000639
C  -1.085482 -1.201913 -0.001239
C  -2.550738 1.220502 0.00036
C  -2.494879 -1.222651 -0.001461
C  -3.2337 -0.016812 -0.000691
C  1.918108 1.10891 -0.001366
H  -0.626796 2.225238 0.0017
H  -0.50096 -2.125108 -0.001811
H  -3.113396 2.159865 0.001046
H  -3.015761 -2.185746 -0.002246
H  -4.328093 -0.040487 -0.000874
H  1.656482 2.160852 -0.002924
