program: Gaussian 09
title: 000138473
version: EM64L-G09RevD.01
frameworkgroup: C1[X(C16H19N)]
method: RPBEPBE
basis: SDD
operation: Freq
keyword: #pfreq=noraman
keyword: PBEPBE/SDD
title: #p freq=noraman PBEPBE/SDD
converged: NO YES NO NO
title: Mulliken charges:
elementType: N C C C C C C C C C C C C C C C C H H H H H H H H H H H H H H H H H H H
charge: -0.544889 0.502359 0.502450 0.498080 0.497974 0.511151 0.509697 -0.651056 -0.650993 -0.576039 -0.575098 -0.613468 -0.612880 -0.823471 -0.823537 -0.818680 -0.817370 0.296672 0.228968 0.228847 0.270114 0.269942 0.234829 0.234994 0.232693 0.222718 0.225678 0.222737 0.232500 0.225843 0.222226 0.224555 0.233396 0.223904 0.220772 0.234382
chargesum: 0.00000
title: Mulliken charges with hydrogens summed into heavy atoms:
elementType: N C C C C C C C C C C C C C C C C
charge: -0.248217 0.502359 0.502450 0.498080 0.497974 0.511151 0.509697 -0.422088 -0.422146 -0.305925 -0.305157 -0.378640 -0.377886 -0.142383 -0.142456 -0.138502 -0.138312
polarizability: 2.93695177e+02 2.61784539e-01 1.91300024e+02 7.49928621e+00 -2.47666385e-01 1.05843338e+02
1716.lowfreq: -0.0003 0.0002 0.0007 4.4834 5.5919 8.1082 18.8145 27.9956 30.7898
frequency: 18.4419 27.9648 30.7850 37.3844 42.0239 64.0072 70.0067 169.3398 176.3731 196.7626 209.9903 216.0623 219.3575 241.7017 268.2280 275.3148 302.8611 412.4687 452.8289 486.5449 507.4798 508.2226 518.9009 524.1301 529.7926 539.9503 564.3987 589.3899 636.0217 682.1593 697.2929 722.8030 848.7658 852.2311 860.0997 870.1763 879.6277 909.5277 921.5823 949.0937 960.0499 969.8269 984.3414 985.6613 1015.8010 1017.2698 1021.1152 1044.1771 1045.9224 1048.2333 1049.2810 1060.0442 1175.9885 1176.3712 1180.7405 1207.1553 1274.8742 1301.6224 1325.1620 1331.3357 1384.9485 1387.8488 1394.9541 1395.2318 1396.1991 1397.8176 1408.3096 1436.2301 1447.1836 1458.8918 1473.1877 1473.5288 1474.0288 1475.2793 1475.9981 1485.5344 1489.7194 1490.7203 1536.7761 1608.7369 1611.1109 1615.3674 1624.2947 2972.8638 2973.0200 2973.5081 2973.8111 3053.9946 3054.1424 3054.6668 3054.7691 3083.4685 3083.5942 3083.8861 3084.0390 3103.6216 3104.4380 3119.4616 3119.6797 3149.6024 3158.3451 3543.9133
redmass: 1.0356 1.0277 3.2623 1.4628 1.8288 1.0298 3.6193 3.5898 3.5925 3.2619 3.3385 3.2933 3.0919 3.4286 2.5819 3.2541 3.4071 3.0204 2.4990 1.6835 4.8461 3.2007 2.9605 3.1817 4.4558 4.2487 3.9455 3.5975 5.4074 3.2722 1.9703 2.6966 1.5032 1.4738 1.3318 1.3757 1.4418 1.5757 2.2323 3.0959 1.9261 3.0867 4.9146 5.6034 1.5583 1.4899 1.7001 1.5377 1.5385 1.5867 1.5852 1.9701 1.4398 1.4431 1.4141 1.7748 1.3381 1.2693 6.0648 2.3037 7.6748 3.3237 1.2241 1.2419 1.3094 1.3178 3.1209 1.9527 1.7845 1.5810 1.0522 1.0540 1.0604 1.0974 1.0585 1.3833 1.6816 1.5805 1.9851 5.8988 6.3877 4.5893 5.9900 1.0386 1.0386 1.0386 1.0385 1.0949 1.0950 1.0950 1.0948 1.0998 1.0997 1.0997 1.0997 1.0910 1.0911 1.0916 1.0916 1.0917 1.0911 1.0752
irintensity: 0.1001 0.1852 0.0330 0.1058 1.6801 0.4604 0.0252 1.1238 11.8941 4.1015 0.1211 0.3601 0.8552 0.1833 0.3710 14.2394 0.0971 0.5037 6.7334 83.8044 1.2761 24.9881 6.3892 1.0589 2.9631 0.1424 0.1132 17.6759 2.9790 0.5908 36.0499 4.7692 87.1569 5.1453 2.8438 0.2917 8.1747 1.2555 0.5853 2.1740 0.7038 3.2425 7.0608 0.4729 1.8601 1.1452 1.2867 1.7923 6.6501 38.5844 21.0959 17.6955 1.8431 1.5984 0.4421 62.4674 0.2172 0.6602 0.9484 15.6494 8.2927 150.9905 3.3008 26.4532 0.5424 2.3927 10.8502 0.7245 55.9701 0.2364 1.3207 15.1352 25.9112 6.7865 9.3637 18.9116 0.9208 273.1134 148.2962 585.7591 76.4415 27.5336 13.4519 6.3020 88.8290 58.0367 8.3259 12.6564 22.0582 23.5612 37.7746 7.3842 26.3184 23.3473 19.3922 14.8534 29.2071 29.3998 4.7455 10.6937 2.1944 13.5614
temp: 298.150 k
press: 1.00000 atm
elementType: 7 6 6 6 6 6 6 6 6 6 6 6 6 6 6 6 6 1 1 1 1 1 1 1 1 1 1 1 1 1 1 1 1 1 1 1
symmnumber: 1
zpe: 794869.4 jmol-1
zpe.correction: 0.302750 hartree
zpe.thermalcorrener: 0.320764 hartree
zpe.thermalcorrenthalpy: 0.321708 hartree
zpe.thermalcorrgfe: 0.253443 hartree
zpe.sumelectzpe: -674.644584 hartree
zpe.sumelectthermal: -674.626570 hartree
zpe.sumelectthermalent: -674.625626 hartree
zpe.sumelectthermalfe: -674.693891 hartree
dipole: -0.0118 -0.6029 0.1203
dipole: 0.6149
quadrupole: -92.4255 -89.9327 -107.0789
quadrupole: 0.2173 1.8344 -0.1003
quadrupole: 4.0535 6.5463 -10.5998 0.2173 1.8344 -0.1003
hfenergy: -674.947334 hartree
pointgroup: C01 [X(C16H19N1)]
dipole: 0.0051333 -0.2372655 -0.0469908 debye
polarizability: 293.5268167|-0.236237|191.3004321|9.3732537|0.1381202|106.0112903 unknown
InChI: InChI=1S/C16H19N/c1-11-5-12(2)8-15(7-11)17-16-9-13(3)6-14(4)10-16/h5-10,17H,1-4H3
charge 0 multiplicity 1
36 atoms
N  0.000424 -1.174616 0.007471
C  1.281187 -0.574393 -0.013119
C  -1.281089 -0.575756 0.023549
C  2.825698 1.271116 -0.53289
C  -2.827361 1.271084 0.533573
C  3.705938 -0.84941 0.369306
C  -3.707242 -0.860497 -0.342689
C  2.389081 -1.356842 0.418248
C  -2.390118 -1.36739 -0.387568
C  1.514834 0.740368 -0.499062
C  -1.514944 0.744588 0.493989
C  3.913002 0.473404 -0.097715
C  -3.915647 0.464469 0.11791
C  3.058293 2.690593 -1.02547
C  -3.06158 2.692305 1.02017
C  4.881292 -1.71406 0.79451
C  -4.876709 -1.710397 -0.811826
H  0.001055 -2.195591 0.014063
H  2.21259 -2.370506 0.803234
H  -2.214494 -2.388673 -0.752522
H  0.682949 1.336478 -0.885582
H  -0.682536 1.346111 0.870893
H  4.930416 0.882961 -0.128419
H  -4.935017 0.868102 0.160759
H  2.932882 3.422547 -0.203536
H  4.07957 2.817318 -1.425441
H  2.3421 2.965862 -1.820075
H  -4.079272 2.816254 1.430044
H  -2.948914 3.419675 0.192322
H  -2.338417 2.976436 1.80526
H  4.59111 -2.440713 1.574004
H  5.710254 -1.101054 1.189917
H  5.27977 -2.2918 -0.062482
H  -5.808068 -1.439078 -0.284261
H  -4.690311 -2.786561 -0.64739
H  -5.060423 -1.570031 -1.895076
