program: Gaussian 09
title: 000138471
version: EM64L-G09RevD.01
frameworkgroup: C1[X(C9H24O2Si3)]
method: RPBEPBE
basis: SDD
operation: Freq
keyword: #p
keyword: freq=noraman
keyword: PBEPBE/SDD
title: #p freq=noraman PBEPBE/SDD
converged: YES YES NO NO
title: Mulliken charges:
elementType: Si Si Si O O C C C C C C C C C H H H H H H H H H H H H H H H H H H H H H H H H
charge: 1.641158 1.493215 1.487856 -0.983162 -0.989686 -1.059636 -1.040720 -1.051727 -1.037874 -1.034299 -1.040867 -1.049129 -0.541653 -0.486717 0.241762 0.248862 0.240815 0.245130 0.230014 0.234427 0.232156 0.248145 0.247957 0.245166 0.240299 0.228086 0.242094 0.243971 0.227678 0.231613 0.235761 0.243952 0.241145 0.245798 0.234527 0.213069 0.213038 0.237777
chargesum: 0.00000
title: Mulliken charges with hydrogens summed into heavy atoms:
elementType: Si Si Si O O C C C C C C C C C
charge: 1.641158 1.493215 1.487856 -0.983162 -0.989686 -0.328196 -0.331150 -0.323470 -0.324323 -0.320556 -0.329540 -0.327659 -0.328584 -0.035903
polarizability: 1.79704977e+02 7.53871340e-01 1.64702186e+02 -7.59137684e+00 -7.06734629e+00 1.66289354e+02
1716.lowfreq: -22.9837 -8.3101 -0.0007 0.0013 0.0018 5.1040 10.5233 17.4577 22.2969
frequency: -19.0023 16.9467 21.7140 32.3770 38.4700 41.4125 83.1158 101.5789 104.9795 114.2813 128.3337 128.8846 137.0878 138.8944 141.6058 145.9383 156.5099 164.2826 173.6763 185.3366 195.7059 207.5646 218.5950 227.7646 230.9180 263.4206 272.9891 313.2154 345.7897 370.9980 422.1187 515.7090 559.7583 599.5197 623.9228 661.6753 692.7795 694.2367 695.4607 698.6624 734.9578 738.9506 743.9364 809.2977 811.0955 812.6543 815.4066 856.1386 866.6437 904.0131 906.8983 910.0289 912.0363 922.2190 929.3888 989.7479 1004.2297 1014.7128 1018.8961 1032.0254 1264.2528 1293.3549 1296.4327 1297.8823 1298.1780 1305.4243 1307.6161 1310.7105 1404.5362 1434.8507 1436.1772 1441.5265 1442.2050 1443.5196 1444.6813 1445.9935 1446.3756 1447.4856 1449.0294 1450.6307 1451.9485 1460.7987 1462.6414 1608.5865 2978.6508 2980.1152 2980.7355 2981.1729 2984.2762 2985.1178 2990.7957 3064.1930 3080.5854 3081.2223 3082.7314 3083.5091 3083.9224 3086.2293 3086.7398 3087.7272 3088.9476 3089.6032 3090.1284 3093.4243 3093.7094 3096.2153 3100.8593 3178.0192
redmass: 3.1531 3.0286 3.6260 3.5371 3.9725 3.7926 2.6396 1.0359 1.0193 2.8934 1.0506 1.0852 1.0320 1.0301 2.4530 1.1000 2.4055 2.3472 2.6100 2.6619 2.5572 2.5987 2.7443 2.7780 2.7815 3.5922 3.8708 4.1959 6.7967 3.7836 4.6841 4.3359 1.7941 3.8737 3.8454 3.3286 2.8708 2.8500 2.8312 2.8102 1.1755 1.1685 4.8281 1.3798 1.3824 1.3813 1.3744 1.3801 1.4507 1.5672 1.5614 1.5942 1.5938 1.6094 1.6139 1.3642 1.3256 6.1849 1.1899 8.5448 1.3276 1.2138 1.2106 1.2104 1.2103 1.2078 1.1953 1.1955 1.2113 1.0544 1.0542 1.0519 1.0507 1.0523 1.0540 1.0515 1.0536 1.0501 1.0487 1.0479 1.0476 1.0465 1.0464 4.2882 1.0344 1.0345 1.0343 1.0344 1.0343 1.0344 1.0342 1.0635 1.0980 1.0980 1.0977 1.0970 1.0864 1.0985 1.0977 1.0980 1.0984 1.0980 1.0979 1.0982 1.0983 1.0981 1.0987 1.1147
irintensity: 0.1972 0.1889 0.8921 1.1749 0.4163 1.8620 0.4052 0.0109 0.0064 0.1022 0.0294 0.0347 0.0026 0.0074 0.2166 0.0587 0.0570 0.1913 0.1387 0.2378 0.1947 0.8851 2.8680 3.6453 1.0309 28.6528 7.6338 44.8433 44.7272 18.1152 0.3343 22.1462 47.4570 11.6594 4.3449 15.9830 9.2130 11.4837 11.5368 10.6071 0.3123 0.0314 86.1558 2.0553 25.2437 34.4467 16.3012 93.7900 117.1062 38.4550 102.1082 222.8869 116.5633 152.2706 22.8653 35.9959 39.3820 610.3962 109.1600 594.4472 2.8231 40.2760 30.2447 20.9429 90.7573 59.4606 52.4950 11.3318 20.5492 0.1004 0.1166 2.0862 7.2791 1.6502 0.2094 11.7816 1.4511 5.4802 4.3827 3.0054 7.2421 23.5374 18.0459 2.9495 12.7054 13.4080 11.8487 13.4394 11.2040 9.9881 9.1661 15.8186 0.8673 2.9288 61.2256 9.7402 18.7285 20.4869 25.2421 19.2089 1.9436 16.5421 39.7558 17.3946 21.5174 17.1865 15.7984 24.2354
temp: 298.150 k
press: 1.00000 atm
elementType: 14 14 14 8 8 6 6 6 6 6 6 6 6 6 1 1 1 1 1 1 1 1 1 1 1 1 1 1 1 1 1 1 1 1 1 1 1 1
symmnumber: 1
zpe: 811624.2 jmol-1
zpe.correction: 0.309131 hartree
zpe.thermalcorrener: 0.333401 hartree
zpe.thermalcorrenthalpy: 0.334345 hartree
zpe.thermalcorrgfe: 0.253193 hartree
zpe.sumelectzpe: -1374.989134 hartree
zpe.sumelectthermal: -1374.964864 hartree
zpe.sumelectthermalent: -1374.963920 hartree
zpe.sumelectthermalfe: -1375.045072 hartree
dipole: -0.0370 -0.8215 -0.3369
dipole: 0.8887
quadrupole: -105.6630 -107.8352 -110.4649
quadrupole: -1.9942 0.7731 -0.4092
quadrupole: 2.3247 0.1525 -2.4772 -1.9942 0.7731 -0.4092
hfenergy: -1375.2982652 hartree
pointgroup: C01 [X(C9H24O2Si3)]
dipole: 0.0153127 0.2704729 -0.2210274 debye
polarizability: 176.2309551|3.0013506|169.7291611|8.5180454|7.8287188|164.7364011 unknown
InChI: InChI=1S/C9H24O2Si3/c1-9-14(8,10-12(2,3)4)11-13(5,6)7/h9H,1H2,2-8H3
charge 0 multiplicity 1
38 atoms
Si 0.034291 -1.043821 1.077241
Si 2.489022 1.071378 0.252714
Si -2.382662 0.515216 -0.597964
O  1.272269 0.121161 1.009274
O  -1.263907 -0.604592 0.072098
C  -0.540767 -1.120718 2.880415
C  1.923214 2.890483 0.338592
C  2.701056 0.506446 -1.558079
C  4.094467 0.813935 1.245116
C  -3.947137 -0.475403 -1.039156
C  -1.596824 1.284404 -2.157034
C  -2.760423 1.865447 0.698198
C  0.691533 -2.694744 0.429461
C  0.132979 -3.376297 -0.606018
H  0.287741 -1.428882 3.54294
H  -0.889355 -0.126011 3.210928
H  -1.369002 -1.841251 2.999815
H  1.756835 3.192745 1.388359
H  2.679802 3.568779 -0.098215
H  0.97579 3.036961 -0.212353
H  3.504086 1.07626 -2.0624
H  2.959953 -0.566994 -1.604914
H  1.766362 0.65341 -2.129564
H  3.936554 1.074393 2.307228
H  4.418987 -0.241356 1.198046
H  4.916168 1.442893 0.854883
H  -3.709743 -1.274565 -1.764352
H  -4.37278 -0.950952 -0.137303
H  -4.723197 0.173915 -1.485246
H  -2.304508 1.962109 -2.670183
H  -0.695037 1.868263 -1.895828
H  -1.2986 0.495597 -2.871232
H  -3.192369 1.422176 1.61408
H  -1.838122 2.405781 0.981046
H  -3.482329 2.605981 0.30557
H  1.577322 -3.122352 0.926878
H  0.533763 -4.33477 -0.964193
H  -0.750531 -2.982728 -1.124548
