program: Gaussian 09
title: 000138470
version: EM64L-G09RevD.01
frameworkgroup: C1[X(C7H7N3O5)]
method: RPBEPBE
basis: SDD
operation: Freq
keyword: #pfreq=noraman
keyword: PBEPBE/SDD
title: #p freq=noraman PBEPBE/SDD
converged: NO YES NO NO
title: Mulliken charges:
elementType: O O O O O N N N C C C C C C C H H H H H H H
charge: -0.253624 -0.194114 -0.208669 -0.251774 -0.255351 -0.624645 0.022788 0.017563 0.169277 0.340161 0.333856 0.414748 -0.532189 -0.529287 -0.533565 0.317326 0.309785 0.369778 0.369926 0.230662 0.230667 0.256679
chargesum: 0.00000
title: Mulliken charges with hydrogens summed into heavy atoms:
elementType: O O O O O N N N C C C C C C C
charge: -0.253624 -0.194114 -0.208669 -0.251774 -0.255351 0.115060 0.022788 0.017563 0.169277 0.340161 0.333856 0.414748 -0.214863 -0.219501 0.184443
polarizability: 1.91874925e+02 9.41273351e+00 1.74090617e+02 -6.76880696e-03 -1.01039589e-03 4.96552813e+01
1716.lowfreq: -9.9130 -6.9356 -3.9150 0.0002 0.0005 0.0007 50.2437 67.6329 83.1407
frequency: 50.2347 67.6302 83.1314 117.2442 161.4688 163.9946 199.6272 213.8686 240.3120 313.1998 333.4476 368.4821 371.0061 405.5310 427.8284 447.3498 460.8682 516.6194 576.0291 638.1995 645.7510 695.9015 696.3295 723.7870 723.8078 774.8881 779.2663 790.8973 855.6054 903.8706 909.7986 939.3281 1016.8946 1067.7763 1079.7119 1111.6675 1151.3952 1168.4593 1179.9323 1233.6593 1248.0592 1323.9587 1338.5673 1346.2218 1414.3242 1437.7770 1444.6822 1468.4977 1471.7886 1503.8413 1541.9753 1557.1197 1646.9822 2969.7720 3062.1515 3141.7862 3187.0965 3189.2958 3343.5441 3497.1919
redmass: 9.3073 14.0920 3.8004 8.9755 4.2502 3.1698 5.0728 12.0499 1.2688 5.0316 12.7026 9.4592 5.7144 3.6877 8.3589 5.5493 10.9730 5.5100 3.8350 4.9098 5.9058 7.3507 7.9883 12.0346 8.8162 1.1726 1.0665 5.8378 6.7985 7.6927 1.5512 1.3873 5.3132 1.8899 2.2335 1.2587 1.8733 3.8013 6.1545 3.6389 1.5465 6.7723 4.6806 4.8728 4.5923 1.2193 4.8975 1.0490 1.1132 1.9492 2.1596 6.9918 7.8659 1.0330 1.1046 1.1000 1.0908 1.0919 1.0442 1.1086
irintensity: 4.1402 0.1423 0.8945 5.1045 4.5402 2.8948 2.2815 12.1375 0.1152 1.2680 0.3154 0.0264 3.9061 1.7797 4.1334 0.0202 4.1380 6.7505 19.5606 0.5208 0.8520 0.0099 14.2068 13.1782 8.4743 256.3201 0.8646 11.4994 16.7683 3.9669 48.3108 8.7092 115.2827 24.5026 5.8360 0.0541 191.0736 454.0925 81.1741 192.3014 210.9535 83.0329 150.1152 89.0515 17.9866 13.1303 34.4945 16.4892 44.5765 57.7540 430.4205 157.5023 5.4172 45.1720 38.5451 16.0689 8.5830 14.1622 66.3240 153.7256
temp: 298.150 k
press: 1.00000 atm
elementType: 8 8 8 8 8 7 7 7 6 6 6 6 6 6 6 1 1 1 1 1 1 1
symmnumber: 1
zpe: 393209.1 jmol-1
zpe.correction: 0.149765 hartree
zpe.thermalcorrener: 0.162956 hartree
zpe.thermalcorrenthalpy: 0.163900 hartree
zpe.thermalcorrgfe: 0.109532 hartree
zpe.sumelectzpe: -810.051812 hartree
zpe.sumelectthermal: -810.038622 hartree
zpe.sumelectthermalent: -810.037678 hartree
zpe.sumelectthermalfe: -810.092046 hartree
dipole: 3.0189 -2.0721 0.0000
dipole: 3.6616
quadrupole: -95.4451 -93.3336 -85.2503
quadrupole: -21.3643 0.0071 0.0047
quadrupole: -4.1021 -1.9906 6.0927 -21.3643 0.0071 0.0047
hfenergy: -810.2015778 hartree
pointgroup: C01 [X(C7H7N3O5)]
dipole: 1.1018572 0.9280103 -0.0000173 debye
dipolederiv: -0.7991771 -0.7297689 -0.0000174 -0.7910312 -1.2005123 -0.000017 -0.0001027 0.0000276 -0.2989779 -0.7431686 0.2742577 0.000029 0.5043321 -0.7734726 -0.0001668 -0.0004357 0.000302 -0.2180177 -1.133004 0.2624193 0.0002237 0.0008631 -0.3831198 0.000081 -0.0005459 0.0002593 -0.2266999 -0.7743546 -0.1392687 0.000052 -0.4641617 -0.5597994 0.0000881 -0.0004285 -0.0001285 -0.2625688 -0.3360382 -0.206738 -0.0000244 0.1485396 -1.0343216 -0.0001043 -0.000104 0.0005522 -0.2662603 -0.5692165 -0.3056612 -0.0001112 -0.3613452 -0.9247467 -0.0000123 -0.0001889 -0.0000403 -0.5309489 2.092342 -0.3515349 0.000065 -0.1760373 1.0387044 0.0000757 0.000789 -0.0001638 0.187537 1.5892608 -0.5085964 -0.0001287 -0.6911304 1.5296575 -0.000112 0.0005636 -0.0007635 0.1818131 0.2941402 0.3627815 0.0000298 0.3854273 0.7128773 0.000062 0.0001269 -0.0000155 0.1371093 -0.9111262 0.3453972 -0.0000831 -0.4452363 -0.0337378 -0.0000215 -0.0000485 0.0000278 0.0189654 -0.3161063 0.0141573 -0.000052 0.8017076 -0.6602471 0.0000856 0.0000183 0.0000114 0.030639 -0.4866287 1.0211159 0.0000297 1.2950753 1.0444664 0.0000428 0.0003474 -0.0001081 0.0818946 0.5419895 -0.5272666 -0.0000316 0.4729209 -0.2246589 0.0000307 0.0000362 0.0000132 -0.0715587 -0.026394 0.1935381 -0.000021 -0.9442175 0.2228949 0.0000081 -0.0000389 -0.0000176 -0.1264087 0.7653516 0.4403288 -0.0000024 0.0767876 0.2782468 -0.0000111 -0.0000465 -0.0000542 0.3194139 0.1496959 0.0406922 0.0000154 -0.0173438 0.1257945 -0.0000134 -0.0000226 0.0000081 0.1737458 0.0738425 -0.0587062 0.000017 0.0218432 0.1627721 -0.000008 -0.0000196 0.0000319 0.1694411 0.3063801 -0.0213183 0.0000046 0.070435 0.3293289 -0.0000306 0.0000269 -0.0000379 0.3608199 0.280991 0.0884527 0.0000182 -0.0136909 0.3257027 0.0000288 0.0000545 0.000071 0.3599853 -0.0341466 -0.0749911 0.0396162 0.1100478 0.0647752 -0.1098178 0.069577 -0.0582246 -0.0747967 -0.0341637 -0.0749752 -0.0396296 0.1100739 0.064747 0.1098289 -0.069553 0.0582663 -0.0747356 0.069531 -0.0443154 0.000001 -0.0938593 -0.1053514 -0.000017 -0.0000051 -0.0000169 0.129609 unknown
polarizability: 193.5445686|-7.491221|172.4209735|0.0068353|-0.0003402|49.6552813 unknown
InChI: InChI=1S/C7H7N3O5/c1-15-4-2-5(9(11)12)7(8)6(3-4)10(13)14/h2-3H,8H2,1H3
charge 0 multiplicity 1
22 atoms
O  1.339931 2.881783 0.00015
O  -3.33147 1.515981 -0.000318
O  3.010521 -1.859368 0.000177
O  -3.433996 -0.755525 -0.000459
O  1.184077 -3.217674 0.000429
N  -1.219812 -2.162965 -0.000142
N  -2.754761 0.363582 0.000222
N  1.728784 -2.025477 -0.000398
C  -0.578223 -0.96369 -0.000062
C  -1.286523 0.306667 0.000126
C  0.865803 -0.843876 -0.000187
C  0.789928 1.60042 0.000073
C  -0.62057 1.54208 0.000183
C  1.529839 0.402789 -0.00011
C  2.806335 2.986579 0.000045
H  -1.208189 2.463349 0.00032
H  2.621936 0.380411 -0.000219
H  -2.247257 -2.145132 0.000052
H  -0.631685 -3.006425 -0.000246
H  3.238603 2.521097 -0.906069
H  3.238748 2.520913 0.905996
H  3.012276 4.065681 0.000139
