program: Gaussian 09
title: 000138467
version: EM64L-G09RevD.01
frameworkgroup: C1[X(C9H9ClO)]
method: RPBEPBE
basis: SDD
operation: Freq
keyword: #p
keyword: freq=noraman
keyword: PBEPBE/SDD
title: #p freq=noraman PBEPBE/SDD
converged: YES YES NO NO
title: Mulliken charges:
elementType: Cl O C C C C C C C C C H H H H H H H H H
charge: -0.074717 -0.416766 0.402306 -0.603826 0.245283 -0.383847 -0.277735 -0.237325 -0.252980 -0.030379 -0.561256 0.212503 0.234942 0.239640 0.232387 0.255277 0.222551 0.360273 0.213044 0.220623
chargesum: 0.00000
title: Mulliken charges with hydrogens summed into heavy atoms:
elementType: Cl O C C C C C C C C C
charge: -0.074717 -0.056493 0.402306 -0.156381 0.245283 -0.144207 -0.277735 -0.004938 0.002298 0.192172 -0.127589
polarizability: 1.33477601e+02 5.24310285e+00 1.28286110e+02 4.92657972e+00 2.64953740e+00 5.92824959e+01
1716.lowfreq: -0.0027 -0.0016 -0.0013 3.4654 4.6345 8.9107 41.9284 57.8117 95.5588
frequency: 41.5971 57.7310 95.5553 165.7573 219.7502 230.9903 289.5085 314.9297 365.4460 381.3567 453.5086 474.9142 520.7580 525.5063 542.4833 589.3964 667.3857 730.6309 768.0900 799.3317 843.0683 897.5492 907.5769 925.9889 943.4544 960.0668 999.6271 1054.9330 1091.5795 1117.3076 1165.8614 1205.3193 1215.2952 1227.0971 1283.2932 1295.6646 1309.3166 1391.7449 1422.2844 1432.8444 1457.4264 1472.5966 1583.7823 1606.1891 1656.2590 2985.1385 3066.6354 3084.3749 3100.3753 3131.1789 3156.2567 3177.6853 3199.4401 3495.5510
redmass: 3.9943 3.4801 3.6176 3.4654 5.9261 4.2878 4.0093 4.0800 9.8464 2.3997 1.0981 2.6375 5.0498 3.6877 3.2203 3.6927 2.7601 3.0887 1.5384 5.5434 3.0187 1.4227 1.6462 2.1230 1.3714 1.3357 1.1338 2.0259 1.9382 2.2352 1.1370 1.4978 1.7815 2.2305 1.2647 1.3931 1.4396 5.8706 1.2279 2.5177 1.3208 2.1735 6.7737 7.1542 4.6949 1.0643 1.0934 1.0710 1.0851 1.0885 1.0914 1.0985 1.1149 1.0648
irintensity: 0.0596 0.1989 0.2968 0.8888 1.3342 0.4132 4.3234 9.3831 3.8866 2.4453 127.1051 1.2967 7.4362 6.5473 2.3407 2.6430 42.4456 34.2827 55.4985 6.0967 21.3061 0.7820 19.9289 7.5506 76.2803 0.9791 15.3600 27.2525 18.7739 40.9745 21.5538 38.4444 44.2472 47.0602 0.4836 1.8262 15.3436 12.5513 18.7149 58.7042 18.5568 19.9718 6.7935 7.1388 19.4997 30.0741 0.8052 19.0711 10.8255 8.7462 9.9294 8.0433 26.9221 54.0841
temp: 298.150 k
press: 1.00000 atm
elementType: 17 8 6 6 6 6 6 6 6 6 6 1 1 1 1 1 1 1 1 1
symmnumber: 1
zpe: 401331.5 jmol-1
zpe.correction: 0.152859 hartree
zpe.thermalcorrener: 0.163518 hartree
zpe.thermalcorrenthalpy: 0.164462 hartree
zpe.thermalcorrgfe: 0.115540 hartree
zpe.sumelectzpe: -882.813919 hartree
zpe.sumelectthermal: -882.803260 hartree
zpe.sumelectthermalent: -882.802316 hartree
zpe.sumelectthermalfe: -882.851238 hartree
dipole: -0.0173 1.1360 0.0781
dipole: 1.1388
quadrupole: -71.8348 -63.5222 -73.7243
quadrupole: -0.2071 0.2016 1.3832
quadrupole: -2.1410 6.1716 -4.0306 -0.2071 0.2016 1.3832
hfenergy: -882.9667779 hartree
pointgroup: C01 [X(C9H9Cl1O1)]
dipole: 0.0704616 -0.441912 -0.0218648 debye
dipolederiv: -0.4073337 -0.2588756 0.0595608 -0.3371137 -0.5627871 0.038777 0.0714316 0.037469 -0.0783113 -0.2825044 0.3428667 0.0084949 0.283104 -1.0656605 -0.1735317 -0.0090234 -0.1664264 -0.3843254 0.329873 -0.1511023 -0.0697975 0.1839719 -0.1161693 -0.0740313 -0.0927114 0.0650696 -0.1009211 -0.0348929 0.0905934 -0.0527593 0.0718578 0.0735527 0.0013292 -0.1796544 -0.0373668 0.0780948 -0.0630265 -0.363815 -0.0250794 -0.4731335 0.7641871 0.2167213 0.0092857 0.1531977 0.0972198 0.010312 0.045204 -0.0624808 -0.0046886 0.0807218 0.0108344 -0.0583942 0.0086739 -0.1387093 0.4233565 0.6107218 -0.0625613 0.4544391 0.6160605 -0.0669575 -0.1041316 -0.1308936 -0.0745752 -0.1159354 0.010006 -0.0239272 -0.0956439 0.0014823 0.0276045 -0.0176293 0.0014143 -0.1659046 -0.1147548 -0.1179702 -0.0252856 0.0576855 -0.1012224 -0.0022544 0.0033997 0.0334525 -0.0925936 -0.0146342 -0.1419856 0.1759671 -0.1307377 0.0587325 0.0928854 0.4278715 0.0351274 0.108738 -0.3677376 -0.0406097 0.1285395 -0.0285462 -0.0954314 0.1617229 0.0617274 0.14469 -0.0275503 0.0001255 -0.0048494 0.0033125 -0.0684324 -0.0747233 0.1291127 -0.0053348 0.0878729 0.0108268 0.0344207 0.0217591 0.0097617 0.0397418 0.0007136 -0.1229606 0.0079521 -0.0487909 0.0128928 0.0243294 -0.116079 0.0369133 -0.096042 -0.0220607 0.0119242 0.0293128 0.0231065 0.1352679 0.0414215 0.0586546 0.0341956 0.0674498 -0.0823039 -0.0295732 0.0437739 -0.0295506 0.1573071 -0.0310177 0.0097314 0.0558036 -0.0045542 0.1058283 -0.0026069 0.0561959 -0.0069387 0.1542772 0.1120167 0.0640186 -0.0280857 0.0240862 -0.0302782 -0.1259439 -0.0758051 -0.0859965 -0.0243801 0.2374689 -0.1186666 0.0205577 -0.057436 0.3494107 0.0254704 0.0306543 0.0412479 0.3561366 0.0713036 0.0468102 -0.1339557 0.0820765 0.0965976 -0.0164175 -0.1772349 -0.0010334 -0.0317765 0.1472096 0.0135873 -0.0491743 0.0319156 0.0033497 -0.1021048 -0.0216857 -0.1243248 0.0082864 unknown
polarizability: 134.8150031|-4.1595719|126.6936646|-7.0628169|0.2386832|59.5375394 unknown
InChI: InChI=1S/C9H9ClO/c1-2-4-7-5-3-6-8(10)9(7)11/h2-3,5-6,11H,1,4H2
charge 0 multiplicity 1
20 atoms
Cl 2.749988 1.974178 -0.310555
O  -0.189176 1.844232 0.51217
C  -0.422485 -0.559558 0.41385
C  -1.892389 -0.412574 0.790601
C  0.3890 0.598971 0.259937
C  0.163072 -1.824551 0.173816
C  1.741257 0.445087 -0.130061
C  1.515601 -1.959633 -0.216159
C  2.321604 -0.809342 -0.373863
C  -2.775878 -0.230706 -0.437697
C  -3.572494 0.841788 -0.666946
H  -2.20943 -1.324451 1.334793
H  -2.028018 0.449134 1.466187
H  -0.456644 -2.719881 0.300911
H  1.945703 -2.94993 -0.394578
H  3.370391 -0.884534 -0.674041
H  -2.734733 -1.044834 -1.177573
H  0.47928 2.565103 0.362603
H  -4.189723 0.914722 -1.569794
H  -3.620626 1.680079 0.038299
