program: Gaussian 09
title: 000138466
version: EM64L-G09RevD.01
frameworkgroup: C1[X(C8H9NO3)]
method: RPBEPBE
basis: SDD
operation: Freq
keyword: #pfreq=noraman
keyword: PBEPBE/SDD
title: #p freq=noraman PBEPBE/SDD
converged: NO NO NO NO
title: Mulliken charges:
elementType: O O O N C C C C C C C C H H H H H H H H H
charge: -0.415746 -0.218560 -0.215780 0.024323 0.032155 0.441555 0.428434 -0.598661 -0.560987 0.329847 -0.782520 -0.780538 0.235994 0.268332 0.257488 0.207537 0.257745 0.214872 0.254871 0.255253 0.364386
chargesum: 0.00000
title: Mulliken charges with hydrogens summed into heavy atoms:
elementType: O O O N C C C C C C C C
charge: -0.051360 -0.218560 -0.215780 0.024323 0.032155 0.441555 0.428434 -0.362666 -0.292655 0.329847 -0.059750 -0.055542
polarizability: 1.54623356e+02 2.44025481e+00 1.30043966e+02 -6.97254630e-04 -6.67840338e-03 5.06462686e+01
1716.lowfreq: -73.6375 -16.5330 -12.6184 -10.0631 -0.0008 -0.0007 -0.0006 65.9405 181.1948
frequency: -73.6119 65.9269 181.1946 203.0395 255.7684 266.6333 277.2925 307.6013 334.4486 341.1407 360.8094 400.5810 403.9836 517.8797 527.3000 555.9404 578.0658 596.5610 597.9936 665.8807 723.4109 774.6276 837.1861 876.4201 959.6381 974.5207 1030.1412 1037.0707 1040.2894 1054.6709 1070.3503 1151.8430 1191.3239 1201.3565 1246.8500 1320.5763 1345.9169 1372.7934 1402.1618 1405.7582 1418.9185 1451.2692 1452.6492 1462.0371 1477.9703 1484.3919 1589.8953 1620.0559 2999.7869 3001.6949 3086.6446 3087.1332 3099.0160 3103.6373 3125.2719 3172.3422 3575.9697
redmass: 7.6065 4.4891 3.9021 2.8757 8.1020 1.0544 1.0684 5.7401 3.8270 9.6997 2.8515 7.0768 1.1292 5.1964 3.0036 4.8649 4.4198 3.8228 6.6692 3.4633 6.1547 9.8847 1.3947 1.4687 3.4796 3.0767 1.7921 1.5458 1.5470 1.6343 7.8024 1.4483 1.4393 7.7428 1.6258 6.2406 5.3306 4.0411 1.3183 1.3683 2.0042 1.0461 1.0463 1.8595 1.2427 1.5759 7.3586 5.6942 1.0365 1.0364 1.0957 1.0958 1.1016 1.1018 1.0917 1.0927 1.0661
irintensity: 0.0413 2.4915 3.3750 2.3621 5.0742 0.4729 0.9390 0.0517 6.2596 0.1852 1.5535 3.6473 147.9292 2.0048 0.9914 0.1196 0.0129 13.0382 12.4312 16.0236 0.0787 10.7209 18.6665 23.4300 8.7606 25.1314 0.5938 17.2784 3.9627 1.4737 55.1345 322.7969 8.9330 269.5058 16.5468 42.2942 134.9788 7.3112 26.6962 40.1840 0.9881 10.2920 14.5285 27.6818 24.6191 21.3074 110.2162 181.9334 20.7274 9.7852 3.2383 9.7118 27.1290 23.7073 17.2587 3.2926 66.3268
temp: 298.150 k
press: 1.00000 atm
elementType: 8 8 8 7 6 6 6 6 6 6 6 6 1 1 1 1 1 1 1 1 1
symmnumber: 1
zpe: 416681.0 jmol-1
zpe.correction: 0.158705 hartree
zpe.thermalcorrener: 0.168934 hartree
zpe.thermalcorrenthalpy: 0.169878 hartree
zpe.thermalcorrgfe: 0.123463 hartree
zpe.sumelectzpe: -589.703423 hartree
zpe.sumelectthermal: -589.693195 hartree
zpe.sumelectthermalent: -589.692250 hartree
zpe.sumelectthermalfe: -589.738665 hartree
dipole: -5.1121 -1.5591 0.0090
dipole: 5.3445
quadrupole: -78.5543 -62.0762 -70.9142
quadrupole: 7.3935 0.0356 0.0098
quadrupole: -8.0394 8.4387 -0.3993 7.3935 0.0356 0.0098
hfenergy: -589.8621285 hartree
pointgroup: C01 [X(C8H9N1O3)]
dipole: 2.005915 0.6305929 0.0041438 debye
dipolederiv: -1.6793208 -0.0477024 0.000286 -0.0394533 -0.0985988 -0.0000013 0.0006945 0.0000333 -0.4193253 -0.7449815 0.22286 0.0003435 0.3208475 -0.7372841 -0.0016452 -0.0023342 0.0022828 -0.2266386 -0.738742 -0.236105 -0.0001688 -0.3138832 -0.7448928 0.0005951 -0.0027865 -0.003554 -0.2250341 1.8718474 0.0220906 0.0008164 0.0018818 1.1888761 0.001315 0.0033523 0.0013244 0.1781101 -0.947212 -0.0257901 -0.0008578 -0.0070731 -0.251225 -0.0001702 0.0003889 -0.0000723 -0.0441086 0.5056415 -0.1489999 -0.0001323 0.1979001 0.3089524 0.0003421 0.0008752 -0.0000011 0.0627776 0.5136613 0.1930739 -0.000179 -0.1849716 0.3178974 -0.0003959 0.0003437 0.0000119 0.0386902 -0.6012605 0.2419506 -0.0000219 0.4258071 -0.1886629 -0.0001378 0.0001876 -0.0002198 -0.242371 -0.5486414 -0.2712373 0.0000303 -0.4150528 -0.1862913 0.0001569 0.0002771 0.0002307 -0.2044355 1.6803551 0.0673994 -0.0004622 0.0332638 0.4429458 -0.0000696 -0.0007716 -0.0000825 0.1583199 0.0411662 0.2647034 -0.0001199 0.1146011 -0.0967965 -0.0000459 -0.0001096 0.0003482 0.0101139 0.0347229 -0.2589908 0.0000006 -0.113033 -0.1106945 -0.0000793 -0.0001649 -0.0005086 0.0182916 -0.0053116 -0.0742351 0.0000295 -0.0954723 -0.0479407 0.0000576 -0.0001576 0.0001822 0.1669731 0.0612095 0.0423879 0.0000073 0.0711195 -0.0179042 -0.0000184 -0.0001829 -0.0001146 0.1638742 0.0490258 0.0166395 0.0861184 -0.0048519 0.0654278 0.0048068 0.0718499 -0.0230922 -0.005881 -0.0485244 -0.2076151 0.000219 -0.0668884 -0.059126 0.0000747 0.0001081 -0.0000058 0.1014538 0.0488931 0.0166383 -0.0861173 -0.005057 0.0658063 -0.0048973 -0.0718186 0.0225534 -0.0052193 -0.0431882 0.2005113 0.0000474 0.0642929 -0.0489666 0.0000611 0.0000296 0.0002443 0.1025122 0.0498496 -0.0169969 0.0878673 0.0025611 0.0664216 -0.0047144 0.0736961 0.0227955 -0.0081201 0.0500708 -0.0172174 -0.0877233 0.0026173 0.0668567 0.0047226 -0.0734468 -0.0223529 -0.0074996 0.4507391 0.0166352 0.0000169 0.0108442 0.0651992 0.0000433 -0.0000303 -0.0000029 0.3875165 unknown
polarizability: 154.5797339|2.6504543|130.0875779|0.0299567|0.0124052|50.6462783 unknown
InChI: InChI=1S/C8H9NO3/c1-5-3-7(10)4-6(2)8(5)9(11)12/h3-4,10H,1-2H3
charge 0 multiplicity 1
21 atoms
O  3.594624 -0.055887 -0.001013
O  -2.729408 1.131542 -0.002782
O  -2.726611 -1.128153 -0.005283
N  -2.092849 0.001989 0.00175
C  -0.614563 0.00476 0.001154
C  0.081222 1.263233 0.000677
C  0.094375 -1.250262 0.000731
C  1.493232 1.23457 -0.000047
C  1.503184 -1.21014 0.000095
C  2.200192 0.014092 -0.000305
C  -0.561427 2.638888 0.000804
C  -0.534953 -2.631832 0.001085
H  2.039255 2.185928 -0.000412
H  2.080051 -2.138626 -0.00013
H  -1.214433 2.787182 0.877076
H  0.222224 3.414501 -0.000275
H  -1.2162 2.78657 -0.874269
H  0.258094 -3.3971 0.00096
H  -1.186728 -2.786665 0.877229
H  -1.187208 -2.786874 -0.874665
H  4.002928 0.845784 -0.00128
