program: Gaussian 09
title: 000138465
version: EM64L-G09RevD.01
frameworkgroup: C1[X(C10H9NO)]
method: RPBEPBE
basis: SDD
operation: Freq
keyword: #p
keyword: freq=noraman
keyword: PBEPBE/SDD
title: #p freq=noraman PBEPBE/SDD
converged: YES YES NO YES
title: Mulliken charges:
elementType: O N C C C C C C C C C C H H H H H H H H H
charge: -0.223109 -0.019862 -0.505255 0.283141 0.134665 -0.435228 -0.338567 -0.339752 -0.242358 -0.226154 -0.219350 -0.159560 0.256274 0.256271 0.272579 0.272648 0.245567 0.278597 0.234961 0.237192 0.237301
chargesum: 0.00000
title: Mulliken charges with hydrogens summed into heavy atoms:
elementType: O N C C C C C C C C C C
charge: -0.223109 -0.019862 0.007290 0.283141 0.134665 0.110000 -0.093000 -0.061155 -0.007397 0.011038 0.017952 -0.159560
polarizability: 1.63515191e+02 2.68586568e-01 1.15903737e+02 1.37846811e-02 4.37396009e-03 5.35321401e+01
1716.lowfreq: -6.0251 -0.0008 -0.0006 0.0007 3.8567 10.5000 39.4086 60.9237 79.5144
frequency: 39.2208 60.9183 79.5128 93.7709 160.3830 194.9272 255.7030 321.9793 365.3728 399.8732 418.0202 445.2865 533.7909 570.4414 612.6552 643.5961 696.7238 753.4981 774.8845 800.0239 859.7534 938.4920 944.2917 982.8148 990.2423 993.3051 1006.4928 1016.7621 1026.7954 1068.4235 1088.9114 1153.8424 1175.1871 1191.3675 1217.1648 1276.3239 1282.3686 1318.1985 1349.0549 1388.6600 1435.0894 1437.2689 1445.7300 1480.9782 1569.2899 1598.3248 1612.4237 2199.7108 2992.1173 3018.8749 3043.4337 3076.6481 3132.0205 3141.1249 3151.8775 3161.3379 3171.7897
redmass: 4.8727 3.3815 7.5172 2.6020 3.8758 5.7125 6.7488 6.8840 3.6223 2.8058 3.1667 7.6921 5.8255 2.2144 6.4452 7.1412 1.8328 1.4786 6.1770 1.6597 1.2484 4.5795 1.3894 5.0420 6.2489 1.3825 1.7223 1.5850 2.0955 2.8554 1.6677 1.1549 1.0667 1.1221 1.9227 1.1033 1.8811 1.3548 1.7148 9.1731 1.2446 1.7463 1.1121 2.1715 6.8455 6.7730 6.4151 12.4213 1.0607 1.0595 1.0994 1.1010 1.0853 1.0879 1.0924 1.0962 1.1014
irintensity: 1.5156 10.9012 3.5791 3.2473 0.5588 5.9702 10.6005 2.0585 0.5895 0.1076 1.9341 1.4001 6.8502 4.2486 0.1420 16.6063 48.1903 69.6323 2.2329 4.3395 0.5119 24.1173 2.3539 19.0158 7.5872 0.5349 0.0827 0.1158 1.4324 2.5410 8.6655 0.5965 2.9138 16.9117 69.4997 0.2353 141.8412 0.9832 45.2849 2.9852 6.0005 16.8784 34.5376 0.9358 106.4573 51.1253 10.8304 18.5401 16.8710 4.6626 3.7160 5.6624 0.2828 4.6939 15.4668 19.1820 18.6697
temp: 298.150 k
press: 1.00000 atm
elementType: 8 7 6 6 6 6 6 6 6 6 6 6 1 1 1 1 1 1 1 1 1
symmnumber: 1
zpe: 425613.8 jmol-1
zpe.correction: 0.162108 hartree
zpe.thermalcorrener: 0.173037 hartree
zpe.thermalcorrenthalpy: 0.173981 hartree
zpe.thermalcorrgfe: 0.123945 hartree
zpe.sumelectzpe: -515.575805 hartree
zpe.sumelectthermal: -515.564876 hartree
zpe.sumelectthermalent: -515.563932 hartree
zpe.sumelectthermalfe: -515.613968 hartree
dipole: 5.2204 -0.7762 0.0011
dipole: 5.2778
quadrupole: -83.9200 -71.9208 -71.1828
quadrupole: -9.8423 0.0004 0.0030
quadrupole: -8.2455 3.7537 4.4918 -9.8423 0.0004 0.0030
hfenergy: -515.737913 hartree
pointgroup: C01 [X(C10H9N1O1)]
dipole: -2.0450041 0.3599382 -0.0014843 debye
dipolederiv: -0.8238305 0.1100041 -0.0002608 0.3421105 -0.8689054 -0.006441 0.0027402 -0.0070832 -0.2991378 -0.3781713 -0.0105618 -0.0005728 -0.1159339 -0.2433892 -0.0004175 -0.00193 -0.000089 -0.2392517 -0.256042 -0.1543538 -0.0033081 -0.4494914 -0.1943183 -0.0059814 -0.0070738 -0.0049818 0.1537574 -0.8070562 0.207802 0.0002412 0.1376842 -0.1399663 -0.0011516 -0.000717 -0.0008978 -0.0206296 1.7247341 -0.1976838 0.0025977 -0.1988421 0.9318337 0.0101274 0.0026494 0.0100155 0.1179867 -0.0024267 -0.060883 -0.0014642 -0.0727284 0.0962142 -0.0016987 -0.0016897 -0.0017073 0.2132984 0.1322837 0.0621878 0.0015316 -0.1518298 0.0176388 0.0014147 -0.0013479 0.0020448 -0.1290176 0.0436262 -0.1552667 -0.0015982 0.1327957 0.0384059 0.0022002 0.0021977 0.0012855 -0.1000968 -0.280803 -0.0428201 -0.0009647 -0.1035209 0.1484037 0.0035752 -0.0017218 0.0037829 -0.1519767 0.0227432 0.2008751 0.0031143 0.1949428 -0.0830935 0.0014857 0.0030661 0.0015027 -0.1518967 0.1429928 -0.0473574 0.0001722 -0.0162175 0.0466404 0.0022324 0.0005962 0.0021248 -0.1284898 0.1842863 0.1468898 0.0026324 0.2434673 0.0462243 0.0021395 0.0038581 0.0018429 -0.0608701 0.042723 0.0246713 0.0295847 0.0572098 0.0334989 -0.0762569 0.0464327 -0.0836931 -0.0064216 0.0432339 0.024814 -0.0286392 0.0577985 0.0294044 0.0775625 -0.0446608 0.0847559 -0.0028281 0.0806375 -0.0275549 -0.0133345 0.0229611 0.064094 0.0600489 -0.0178118 0.0659648 0.0182515 0.0806327 -0.0274491 0.0130625 0.0230372 0.0672685 -0.0586699 0.018851 -0.0648791 0.0154688 -0.0113986 -0.1000746 -0.0017121 -0.1139302 0.0362102 -0.0017061 -0.0018702 -0.0016484 0.1416868 0.1364996 0.0407397 0.0004798 -0.009472 -0.0051713 -0.0020707 -0.0001978 -0.0019045 0.1532728 0.0709062 0.0250827 0.0000616 0.0496064 -0.1045498 -0.0032804 0.0003977 -0.0033546 0.1604824 -0.0548521 -0.0879536 -0.0017848 -0.1006524 0.0141287 -0.0021805 -0.0019422 -0.0021395 0.158957 -0.0907188 0.0688921 0.0001614 0.0710051 0.0694282 -0.000932 0.0001738 -0.0009416 0.1574548 unknown
polarizability: 163.4947613|-1.0013257|115.9126889|0.3287564|0.806162|53.5436182 unknown
InChI: InChI=1S/C10H9NO/c11-8-4-7-10(12)9-5-2-1-3-6-9/h1-3,5-6H,4,7H2
charge 0 multiplicity 1
21 atoms
O  0.51461 -2.033518 -0.021643
N  4.988548 1.0067 0.032906
C  1.546477 0.168249 0.010629
C  -1.039429 -0.188426 -0.002535
C  0.338759 -0.779008 -0.005815
C  2.878024 -0.620774 0.005304
C  -1.269644 1.214608 0.014905
C  -2.152311 -1.074224 -0.01735
C  -2.587111 1.71963 0.017594
C  -3.466474 -0.568762 -0.014679
C  -3.687213 0.830351 0.002865
C  4.04602 0.274672 0.020472
H  1.492006 0.819766 0.904114
H  1.498179 0.842286 -0.866363
H  2.918383 -1.296489 0.878736
H  2.924331 -1.274711 -0.88425
H  -0.429478 1.916977 0.026331
H  -1.954595 -2.151223 -0.030647
H  -2.757764 2.801372 0.031104
H  -4.31817 -1.257293 -0.026149
H  -4.709546 1.224417 0.004971
