program: Gaussian 09
title: 000138464
version: EM64L-G09RevD.01
frameworkgroup: C1[X(C8H12N2O6)]
method: RPBEPBE
basis: SDD
operation: Freq
keyword: #p
keyword: freq=noraman
keyword: PBEPBE/SDD
title: #p freq=noraman PBEPBE/SDD
converged: YES YES NO NO
title: Mulliken charges:
elementType: O O O O O O N N C C C C C C C C H H H H H H H H H H H H
charge: -0.302995 -0.302981 -0.412143 -0.412146 -0.239625 -0.239579 -0.322687 -0.322720 -0.523661 -0.523559 -0.472206 -0.472176 0.279598 0.279577 0.196544 0.196509 0.231343 0.277336 0.231289 0.277285 0.296053 0.259624 0.296050 0.259615 0.352953 0.352947 0.379877 0.379878
chargesum: 0.00000
title: Mulliken charges with hydrogens summed into heavy atoms:
elementType: O O O O O O N N C C C C C C C C
charge: -0.302995 -0.302981 -0.032266 -0.032268 -0.239625 -0.239579 0.030266 0.030227 -0.014983 -0.014985 0.083471 0.083490 0.279598 0.279577 0.196544 0.196509
polarizability: 1.94354796e+02 -5.80094070e+00 1.08391908e+02 -3.21611434e+00 -1.90411326e+00 8.09616831e+01
1716.lowfreq: -4.8049 -1.7003 -0.0009 -0.0004 0.0007 2.5435 15.0688 28.4124 32.2576
frequency: 15.0686 28.4124 32.2544 32.9691 41.9295 75.1813 82.6609 100.5225 115.2888 119.5120 169.1336 170.9818 254.6991 268.3794 286.1055 317.6286 389.1311 453.3529 479.1365 514.2214 518.4885 548.5370 569.9372 578.9076 599.3179 615.8163 644.5453 648.3164 653.3605 673.2021 720.3357 791.1378 793.7716 866.5937 889.6364 922.9192 994.8681 1014.5898 1016.3684 1034.1795 1046.3225 1085.2562 1091.2414 1120.5959 1151.5439 1171.5701 1195.3094 1241.7946 1242.9284 1244.3667 1265.0373 1273.3215 1318.2186 1335.0335 1373.9173 1380.7616 1427.8624 1443.0823 1443.5073 1453.9499 1454.1219 1530.6433 1558.3628 1611.4987 1664.3461 1664.5191 2996.9584 2997.0295 3004.2748 3004.4119 3052.4394 3052.4842 3077.1043 3077.1572 3497.6506 3509.2683 3514.2298 3514.2960
redmass: 7.2872 11.1517 7.5807 7.8622 4.9560 3.1830 3.6339 3.8257 3.7023 4.4046 5.3237 6.2968 7.8976 6.3973 6.3766 4.8206 5.4039 3.5708 2.9730 1.9574 1.9522 2.5182 4.4425 2.9674 1.9884 1.4286 1.3230 1.4598 1.6653 4.9323 4.2699 1.6299 1.5948 5.5527 3.9118 4.3889 3.3955 2.4643 2.0971 3.7152 3.0445 2.3902 2.3379 2.2372 1.2427 1.4640 1.3528 1.5507 1.3646 1.4532 1.2699 1.4888 1.4759 1.7494 1.9404 1.9793 3.4678 1.0799 1.0742 1.1010 1.1128 2.3542 8.3055 6.7700 8.1926 8.1631 1.0619 1.0619 1.0623 1.0624 1.0985 1.0985 1.0982 1.0982 1.0802 1.0797 1.0640 1.0640
irintensity: 0.2736 2.5901 0.0000 0.1005 0.0001 0.0002 3.6647 5.0687 10.0899 0.0009 49.8387 0.0000 3.0091 0.0001 0.0001 0.0000 89.5845 0.0001 28.3790 0.0065 51.8905 0.0001 84.0003 0.0006 147.2116 103.4435 0.0357 242.3373 0.0115 3.8011 0.0002 0.0009 26.5468 7.4106 0.0001 10.7685 0.0001 0.0015 125.8449 0.0043 390.6411 0.0006 145.2165 0.0000 15.5536 0.0000 22.5167 0.0001 28.5706 0.0001 104.7027 0.0001 12.9518 0.0001 319.8039 0.0000 531.4245 12.3451 0.0053 1.0346 130.2239 0.0000 493.0682 0.0002 396.2769 21.5453 2.3813 5.1382 55.9108 2.0993 3.1313 14.3333 4.2053 14.5227 0.0004 198.5394 31.1940 21.4509
temp: 298.150 k
press: 1.00000 atm
elementType: 8 8 8 8 8 8 7 7 6 6 6 6 6 6 6 6 1 1 1 1 1 1 1 1 1 1 1 1
symmnumber: 1
zpe: 551046.7 jmol-1
zpe.correction: 0.209883 hartree
zpe.thermalcorrener: 0.227299 hartree
zpe.thermalcorrenthalpy: 0.228243 hartree
zpe.thermalcorrgfe: 0.159874 hartree
zpe.sumelectzpe: -871.689100 hartree
zpe.sumelectthermal: -871.671684 hartree
zpe.sumelectthermalent: -871.670739 hartree
zpe.sumelectthermalfe: -871.739108 hartree
dipole: -0.0011 -0.0003 -0.0001
dipole: 0.0011
quadrupole: -76.8989 -105.5752 -96.4633
quadrupole: -1.6579 13.1292 2.0973
quadrupole: 16.0802 -12.5961 -3.4841 -1.6579 13.1292 2.0973
hfenergy: -871.8989822 hartree
pointgroup: C01 [X(C8H12N2O6)]
dipole: 0.0004249 0.0001294 -0.0000305 debye
polarizability: 194.0211025|-5.9099384|108.493322|6.6270882|-1.9347417|81.1939625 unknown
InChI: InChI=1S/C8H12N2O6/c11-5(1-3-7(13)14)9-10-6(12)2-4-8(15)16/h9-10,13,15H,1-4H2
charge 0 multiplicity 1
28 atoms
O  1.673104 -1.385274 1.043151
O  -1.669091 1.389167 -1.006495
O  6.607252 -0.703072 -0.364348
O  -6.602014 0.709455 0.405874
O  5.800159 1.221978 0.65205
O  -5.797542 -1.216709 -0.610539
N  0.622692 0.300405 -0.113787
N  -0.618497 -0.297792 0.148404
C  3.066229 0.444042 0.122122
C  -3.062291 -0.440202 -0.085882
C  4.227349 -0.550322 -0.067454
C  -4.222549 0.554521 0.107022
C  1.760783 -0.295491 0.385528
C  -1.756729 0.299059 -0.349434
C  5.576196 0.110958 0.121664
C  -5.57215 -0.105688 -0.080809
H  2.973699 1.119407 -0.747996
H  3.29211 1.085553 0.996032
H  -2.969148 -1.117403 0.782738
H  -3.289581 -1.079799 -0.960816
H  4.127372 -1.362388 0.679866
H  4.19975 -1.041743 -1.055458
H  -4.123452 1.367655 -0.639245
H  -4.193167 1.04437 1.095771
H  0.550136 1.169743 -0.653475
H  -0.545985 -1.166635 0.68889
H  7.483488 -0.261266 -0.194556
H  -7.478824 0.268372 0.237185
