program: Gaussian 09
title: 000138463
version: EM64L-G09RevD.01
frameworkgroup: C1[X(C9H10O2S)]
method: RPBEPBE
basis: SDD
operation: Freq
keyword: #p
keyword: freq=noraman
keyword: PBEPBE/SDD
title: #p freq=noraman PBEPBE/SDD
converged: YES YES NO NO
title: Mulliken charges:
elementType: S O O C C C C C C C C C H H H H H H H H H H
charge: 0.935556 -0.569157 -0.553124 0.468262 -0.525515 -0.155163 -0.742193 -0.376297 -0.362133 -0.229861 -0.225465 -0.229118 0.280422 0.285809 0.293881 0.262347 0.267216 0.241375 0.228270 0.235485 0.233059 0.236345
chargesum: 0.00000
title: Mulliken charges with hydrogens summed into heavy atoms:
elementType: S O O C C C C C C C C C
charge: 0.935556 -0.569157 -0.553124 0.468262 -0.245094 0.130647 0.081251 -0.134923 -0.133863 0.005623 0.007594 0.007227
polarizability: 2.16959508e+02 9.50234987e+00 1.22688995e+02 -1.65099859e+00 1.21450044e+00 7.38625341e+01
1716.lowfreq: -3.4945 -0.0006 -0.0002 0.0013 1.9899 7.0849 33.9196 62.5808 81.5284
frequency: 33.8748 62.5498 81.5166 110.1737 164.1818 179.1855 208.8682 215.2889 259.3929 290.6138 346.4647 371.2016 402.7511 420.8788 498.1978 543.6731 593.6335 615.1950 684.4306 695.0094 756.4872 781.2776 813.9107 828.4756 849.9410 883.3648 927.3225 971.6912 981.1009 990.0662 998.7381 1004.4757 1009.7330 1026.4591 1081.7600 1151.6929 1177.1445 1194.3870 1231.9300 1292.6906 1303.1155 1337.2095 1387.2761 1407.9055 1421.9952 1439.5089 1484.4843 1583.5233 1611.2962 1622.3496 3029.4670 3066.2498 3128.6917 3131.8305 3143.7457 3155.1289 3170.2614 3177.7763 3183.9510 3185.6965
redmass: 4.2759 4.5194 5.2185 3.5236 1.0911 5.2783 3.1268 4.6821 3.9183 4.1664 6.6498 8.1348 2.7491 4.6997 2.9634 7.1280 7.8590 6.4553 4.1933 1.8388 1.6399 8.3812 1.9288 4.3952 1.2579 3.1859 1.3941 1.3296 1.3893 6.0598 1.3007 1.8073 1.2903 2.1759 1.5805 1.1905 1.0557 1.1139 2.6364 1.4563 1.1513 1.2561 7.3692 1.0519 1.0538 2.2714 2.2689 5.8668 5.9897 6.0774 1.0247 1.0882 1.0860 1.0877 1.0919 1.0966 1.1017 1.1067 1.1066 1.0984
irintensity: 2.6982 4.6616 1.3001 3.2555 0.1054 2.1349 0.8117 0.7943 1.8300 4.8091 18.3772 65.2107 0.0199 3.8738 8.1576 5.6806 45.7253 0.1275 43.5108 35.9058 104.0246 87.2789 17.5976 7.5761 0.6275 31.6468 0.0152 90.5586 1.0001 0.9384 17.9684 50.5306 23.0973 5.0362 2.9090 15.5125 0.5918 3.1673 18.5988 7.7333 4.1491 12.8155 6.1311 10.1025 13.8121 12.7563 9.2249 6.5314 7.1657 41.4289 1.4579 1.8292 3.6431 0.6839 7.8157 32.0372 22.8970 0.6227 4.6379 10.5789
temp: 298.150 k
press: 1.00000 atm
elementType: 16 8 8 6 6 6 6 6 6 6 6 6 1 1 1 1 1 1 1 1 1 1
symmnumber: 1
zpe: 434849.7 jmol-1
zpe.correction: 0.165626 hartree
zpe.thermalcorrener: 0.178019 hartree
zpe.thermalcorrenthalpy: 0.178963 hartree
zpe.thermalcorrgfe: 0.125985 hartree
zpe.sumelectzpe: -896.395589 hartree
zpe.sumelectthermal: -896.383196 hartree
zpe.sumelectthermalent: -896.382252 hartree
zpe.sumelectthermalfe: -896.435230 hartree
dipole: 4.5755 -1.7255 4.3865
dipole: 6.5692
quadrupole: -75.7484 -76.7309 -83.7682
quadrupole: 3.5111 -15.2851 -1.7220
quadrupole: 3.0008 2.0183 -5.0190 3.5111 -15.2851 -1.7220
hfenergy: -896.5612149 hartree
pointgroup: C01 [X(C9H10O2S1)]
dipole: -1.758042 -1.0635398 -1.567749 debye
dipolederiv: 2.113025 -0.1290552 0.0357788 0.2743842 1.1524524 0.0924621 -0.1594868 0.0560703 1.3619207 -0.7176331 0.0103764 0.0226022 -0.123848 -0.6691394 -0.056727 0.0719506 0.0688999 -0.5275304 -0.8269271 0.0413175 -0.0658989 0.0658011 -0.5286713 0.1171667 -0.0251416 -0.0056563 -0.6613606 -0.2495412 -0.0181311 -0.0027167 -0.0267468 0.0059628 0.0132195 0.0295794 0.0113098 0.0553725 -0.7597229 0.1174241 -0.0327377 0.2620446 -0.1604281 -0.0854893 -0.0290721 -0.0873656 -0.40683 0.6828967 -0.0390009 0.0299217 -0.2944578 0.0421327 -0.0287595 0.0956986 -0.0214873 -0.0568509 -0.2983807 0.0328429 0.0077368 -0.0303106 -0.1293364 -0.0808746 0.0285714 -0.059329 -0.236531 -0.0127081 0.1167342 -0.0227441 -0.0925503 0.0445156 -0.0565843 0.0336846 -0.0394844 -0.1391552 0.0023762 -0.080402 0.0340215 0.0816726 -0.008221 -0.03543 -0.0071108 -0.0469403 -0.1186948 -0.0462076 -0.1432798 0.0473735 -0.1892908 0.0383301 -0.0599545 0.0533025 -0.0588051 -0.1254437 -0.1614353 0.1206956 -0.0319005 0.1971107 0.0749038 -0.05225 -0.0601289 -0.0563721 -0.1283952 0.0731459 0.0195179 0.0098715 -0.0341035 -0.017501 -0.0373011 0.0219831 -0.0349679 -0.1350475 -0.1024016 -0.0568038 -0.0056442 -0.104161 0.0325734 0.0410005 -0.04742 0.046208 0.1863132 0.1467624 -0.0113419 0.0003081 -0.0196679 0.0353648 0.026568 -0.0058868 0.0253956 0.1321895 -0.0365461 -0.0215064 0.0076943 0.002823 0.094117 -0.0196602 0.0648341 -0.0260214 0.08595 0.1148098 -0.0101229 0.0375617 -0.0234498 -0.0515635 -0.0108035 0.0336812 -0.0096289 0.0423803 0.0701818 0.0448945 -0.0232173 0.0577513 0.0677109 0.0084484 -0.0533785 0.0132077 -0.0380449 0.0555077 -0.0957994 0.0193853 -0.0661503 -0.025515 0.0475262 0.0138139 0.0432834 0.1431089 0.0453348 0.1023222 -0.0368181 0.079011 -0.0092823 0.0463114 -0.0302602 0.0496856 0.1260225 0.0007988 0.0841586 -0.031893 0.1047793 -0.029617 0.058639 -0.0383866 0.0578667 0.1425059 0.0283772 -0.0683578 0.0123479 -0.0997691 -0.05575 0.0556031 0.0202135 0.0572197 0.1428417 -0.1217124 -0.0164828 -0.0110328 -0.0208719 0.0969615 0.0168892 -0.0110406 0.0169115 0.1552792 unknown
polarizability: 215.8667269|-11.9385317|119.1810722|7.4426509|-14.3838071|78.4632377 unknown
InChI: InChI=1S/C9H10O2S/c1-12(10,11)8-7-9-5-3-2-4-6-9/h2-8H,1H3
charge 0 multiplicity 1
22 atoms
S  3.069948 -0.113281 0.39065
O  3.07735 1.506998 0.124825
O  3.754272 -0.783416 1.71919
C  -1.121462 0.070521 0.00314
C  1.274938 -0.680047 0.33128
C  0.33927 0.253886 0.035871
C  3.898765 -0.92679 -1.131274
C  -1.931919 1.184141 -0.355632
C  -1.755855 -1.165906 0.315412
C  -3.336755 1.067843 -0.40509
C  -3.15824 -1.280692 0.265493
C  -3.954441 -0.165469 -0.09559
H  1.161127 -1.722332 0.639363
H  0.71948 1.264631 -0.190661
H  4.94965 -0.609099 -1.080158
H  3.792106 -2.014284 -1.016655
H  3.389298 -0.535687 -2.022079
H  -1.452633 2.141772 -0.591815
H  -1.153589 -2.034961 0.602809
H  -3.947186 1.934198 -0.681081
H  -3.636571 -2.235381 0.509814
H  -5.045252 -0.258945 -0.131811
