program: Gaussian 09
title: 000138462
version: EM64L-G09RevD.01
frameworkgroup: C1[X(C10H20O)]
method: RPBEPBE
basis: SDD
operation: Freq
keyword: #pfreq=noraman
keyword: PBEPBE/SDD
title: #p freq=noraman PBEPBE/SDD
converged: YES YES NO NO
title: Mulliken charges:
elementType: O C C C C C C C C C C H H H H H H H H H H H H H H H H H H H H
charge: -0.204265 0.181804 -0.512717 0.165554 -0.376213 -0.340224 -0.701920 -0.705556 -0.721469 -0.356231 -0.696653 0.234184 0.233891 0.221219 0.204008 0.182073 0.182171 0.220235 0.234562 0.209386 0.215968 0.242431 0.200324 0.221206 0.216934 0.219693 0.198442 0.196537 0.217044 0.208498 0.209081
chargesum: 0.00000
title: Mulliken charges with hydrogens summed into heavy atoms:
elementType: O C C C C C C C C C C
charge: -0.204265 0.181804 -0.044641 0.165554 0.049014 0.024020 -0.037736 -0.046834 -0.063635 0.038748 -0.062029
polarizability: 1.33199357e+02 6.20158321e-02 1.04417559e+02 -2.21869686e-01 9.33073316e-02 9.38153305e+01
1716.lowfreq: -37.9464 -9.6790 -8.2908 0.0003 0.0005 0.0007 14.4447 20.6406 52.8187
frequency: -25.3398 19.5855 52.7508 73.6676 104.3779 113.7785 156.7747 190.8779 212.5321 219.6733 232.2083 243.9716 259.7478 294.1586 343.5253 361.1592 382.8276 412.1162 483.7715 549.8672 575.3851 717.7277 747.5014 753.3259 830.3475 838.5035 897.2094 925.1326 935.8202 945.7689 947.1742 977.8669 1003.2103 1022.4766 1049.5660 1073.2686 1080.9198 1092.0246 1121.6231 1190.8198 1201.6649 1222.4216 1233.0808 1251.9723 1257.8682 1280.8543 1289.3202 1304.9156 1345.3158 1353.8747 1369.0408 1378.0971 1386.9013 1401.8425 1427.1883 1453.7101 1460.6463 1463.7150 1465.8336 1466.4651 1475.4446 1476.8467 1477.5473 1481.9190 1486.4922 1494.2841 1610.1503 2947.4161 2956.2797 2968.0846 2970.7348 2974.1360 2977.1417 2986.6745 2986.8168 2991.1894 3005.4497 3021.9562 3054.8830 3067.3840 3068.8716 3070.3571 3070.6953 3078.8108 3080.3515 3082.3639 3101.3351
redmass: 1.7588 3.7036 2.9196 3.5462 1.9071 2.0348 1.0854 2.1373 1.6143 3.1846 1.1055 1.3453 1.3137 2.7032 2.8854 2.2386 2.9490 2.9667 3.1099 2.8605 2.3651 1.0900 2.4973 1.5606 2.4085 1.4577 1.8449 1.7568 1.5949 1.2313 1.2643 2.6801 1.3734 1.9969 2.4159 1.9887 2.2103 1.5071 2.6401 1.8424 2.1974 2.1168 1.9982 1.2797 2.0313 1.0691 1.1147 1.5440 1.6124 1.7010 1.1828 1.1957 1.2164 1.2057 1.0888 1.0511 1.0703 1.0495 1.0542 1.0695 1.0553 1.0540 1.0589 1.0506 1.0817 1.0658 9.0895 1.0588 1.0620 1.0573 1.0380 1.0342 1.0354 1.0362 1.0815 1.0778 1.0941 1.1026 1.1024 1.1008 1.1000 1.1000 1.0992 1.0998 1.0992 1.0997 1.0988
irintensity: 0.3476 0.9412 1.2821 1.2392 0.0425 0.6741 0.0740 0.1514 0.1002 1.5619 0.0057 0.2144 0.0532 2.8856 5.2880 0.0863 0.4781 3.2678 2.9599 1.9843 0.3760 11.3408 1.6123 0.2404 8.7596 5.3117 1.3360 2.7210 3.1877 0.3075 0.7708 43.9037 0.3657 0.0610 24.0989 1.7983 4.9902 1.7192 31.0308 0.6802 4.2260 13.4589 17.0885 0.2881 3.1625 0.8953 1.1585 19.2417 10.1559 6.1568 17.7883 29.1671 10.1601 12.0443 13.5282 1.9595 0.5138 1.1959 0.4926 0.8007 8.9815 13.6044 12.0202 12.5127 18.6142 34.6940 99.5191 15.3501 18.8938 52.6709 30.0265 29.8979 24.6284 29.5370 20.6451 24.5740 7.9076 15.6211 31.1489 95.3212 21.3878 28.3852 47.8046 26.2144 66.1867 42.7231 25.5337
temp: 298.150 k
press: 1.00000 atm
elementType: 8 6 6 6 6 6 6 6 6 6 6 1 1 1 1 1 1 1 1 1 1 1 1 1 1 1 1 1 1 1 1
symmnumber: 1
zpe: 726201.4 jmol-1
zpe.correction: 0.276595 hartree
zpe.thermalcorrener: 0.290670 hartree
zpe.thermalcorrenthalpy: 0.291614 hartree
zpe.thermalcorrgfe: 0.235148 hartree
zpe.sumelectzpe: -467.369339 hartree
zpe.sumelectthermal: -467.355265 hartree
zpe.sumelectthermalent: -467.354320 hartree
zpe.sumelectthermalfe: -467.410787 hartree
dipole: -0.1537 -2.8785 0.2064
dipole: 2.8900
quadrupole: -68.2133 -76.8799 -69.0503
quadrupole: 4.0668 -0.6459 0.4185
quadrupole: 3.1678 -5.4987 2.3309 4.0668 -0.6459 0.4185
hfenergy: -467.6459344 hartree
pointgroup: C01 [X(C10H20O1)]
dipole: -0.0605396 1.1301004 0.1095858 debye
polarizability: 133.1926192|-0.1370139|104.0878999|0.5480846|1.8417752|94.1517274 unknown
InChI: InChI=1S/C10H20O/c1-5-6-7-8-9(11)10(2,3)4/h5-8H2,1-4H3
charge 0 multiplicity 1
31 atoms
O  -1.081299 -1.731968 -0.169052
C  -2.50424 0.26164 -0.017444
C  0.140267 0.340501 0.190622
C  -1.139282 -0.483181 -0.002026
C  1.434644 -0.428852 -0.136021
C  2.705953 0.400106 0.150201
C  -2.666032 0.87274 -1.446123
C  -3.652226 -0.744219 0.240993
C  -2.547379 1.396791 1.041164
C  4.009613 -0.363424 -0.178056
C  5.28163 0.461707 0.112693
H  0.073605 1.271849 -0.407807
H  0.160966 0.678536 1.249402
H  1.4530 -1.367917 0.448328
H  1.418299 -0.737651 -1.199921
H  2.72046 0.700073 1.219676
H  2.680012 1.343097 -0.436194
H  -3.634807 1.401982 -1.511474
H  -2.653518 0.080931 -2.216541
H  -1.866482 1.599886 -1.67921
H  -3.579752 -1.17716 1.255075
H  -3.612175 -1.579488 -0.47752
H  -4.62939 -0.235285 0.147816
H  -1.778897 2.169635 0.861159
H  -3.534462 1.89429 1.007481
H  -2.406522 0.998921 2.063361
H  4.034938 -1.305105 0.406988
H  3.996345 -0.662542 -1.245977
H  6.197953 -0.106247 -0.132204
H  5.293849 1.394973 -0.481839
H  5.335229 0.744982 1.181052
