program: Gaussian 09
title: 000138461
version: EM64L-G09RevD.01
frameworkgroup: C1[X(C8H4N2O4)]
method: RPBEPBE
basis: SDD
operation: Freq
keyword: #pfreq=noraman
keyword: PBEPBE/SDD
title: #p freq=noraman PBEPBE/SDD
converged: NO NO NO NO
title: Mulliken charges:
elementType: O O O O N N C C C C C C C C H H H H
charge: -0.136535 -0.136501 -0.127266 -0.127268 -0.254790 0.146191 0.158661 0.158696 0.166392 0.166383 -0.328365 -0.328365 -0.201701 -0.201711 0.275770 0.275766 0.247319 0.247322
chargesum: 0.00000
title: Mulliken charges with hydrogens summed into heavy atoms:
elementType: O O O O N N C C C C C C C C
charge: -0.136535 -0.136501 -0.127266 -0.127268 -0.254790 0.146191 0.158661 0.158696 0.166392 0.166383 -0.052595 -0.052599 0.045619 0.045611
polarizability: 1.71280825e+02 1.67662919e-04 1.35208735e+02 1.82799416e-02 2.08134962e-03 4.23397447e+01
1716.lowfreq: -60.9916 0.0002 0.0004 0.0008 8.3878 8.6991 10.2156 59.5168 127.8903
frequency: -60.9336 59.4934 127.8654 159.2480 177.6625 219.6618 265.7305 306.6180 341.9652 381.7898 406.1792 445.0264 517.3674 531.9090 634.8190 653.3079 667.6990 688.3540 697.7641 718.6511 781.7723 795.9715 827.8867 835.9803 910.7968 981.6419 1004.8700 1010.7355 1012.2380 1051.3666 1083.2903 1147.1487 1173.9283 1177.9881 1237.2743 1282.5326 1416.8789 1436.1066 1454.6086 1459.1500 1611.8106 1617.1454 1663.4252 1693.6998 3145.7263 3159.0072 3170.5834 3179.5189
redmass: 15.3272 10.6796 4.8959 8.8906 8.1954 8.4625 9.5646 12.7784 11.1398 13.4178 3.0896 4.7985 8.1183 11.1295 9.9559 4.8195 11.0515 8.1078 3.8524 9.5771 5.2889 1.5175 9.2228 7.3743 1.3894 1.4057 11.3955 2.4239 1.3565 6.8692 2.7216 4.8558 2.0594 1.1965 4.4360 1.5011 7.8975 14.0985 2.4586 2.6108 7.2998 7.9271 12.9658 12.9553 1.0870 1.0909 1.0958 1.1005
irintensity: 0.0000 1.0017 0.0000 2.2589 0.1387 2.1164 1.1644 13.1259 0.2423 2.9819 2.1050 0.0000 8.3003 19.9581 31.3885 0.0000 0.6372 12.3771 77.6691 59.1904 0.0000 41.0400 113.9113 42.2623 0.0000 2.0174 53.0031 73.6390 0.0000 792.5442 0.0164 89.0057 0.0450 1.0463 140.7854 0.1492 2.1967 64.1536 18.7961 0.2171 19.6930 0.0070 445.7160 53.9741 1.7602 3.4813 2.0452 15.2803
temp: 298.150 k
press: 1.00000 atm
elementType: 8 8 8 8 7 7 6 6 6 6 6 6 6 6 1 1 1 1
symmnumber: 1
zpe: 295024.2 jmol-1
zpe.correction: 0.112369 hartree
zpe.thermalcorrener: 0.122428 hartree
zpe.thermalcorrenthalpy: 0.123372 hartree
zpe.thermalcorrgfe: 0.076190 hartree
zpe.sumelectzpe: -716.575316 hartree
zpe.sumelectthermal: -716.565258 hartree
zpe.sumelectthermalent: -716.564313 hartree
zpe.sumelectthermalfe: -716.611496 hartree
dipole: 7.6471 -0.0003 -0.0014
dipole: 7.6471
quadrupole: -74.2923 -87.5143 -77.7169
quadrupole: -0.0002 0.0110 -0.0003
quadrupole: 5.5489 -7.6731 2.1243 -0.0002 0.0110 -0.0003
hfenergy: -716.6876852 hartree
pointgroup: C01 [X(C8H4N2O4)]
dipole: 3.0086086 -0.0001221 -0.0005321 debye
dipolederiv: -0.4889869 0.1525402 -0.0002708 0.0874042 -0.9158107 0.0006148 -0.000101 -0.0004242 -0.2802658 -0.4889772 -0.1525694 -0.0001959 -0.087423 -0.9158269 -0.0004413 -0.0000713 0.0004288 -0.2802421 -0.7680734 0.196231 0.0002303 0.3554608 -0.563686 -0.0002208 0.0004509 -0.0001285 -0.1508188 -0.7680063 -0.1961936 0.0001731 -0.3554262 -0.5637021 0.0000224 0.0003239 -0.0000792 -0.1508205 -2.1336767 -0.0000408 0.0004097 -0.0000328 -1.0735828 -0.0000109 0.0014099 0.0000559 -0.0937946 2.7647637 -0.0000203 -0.0009638 0.0000036 1.1014794 0.0002766 -0.0017946 0.000232 0.2036341 -0.5242162 0.1919929 -0.0000164 0.2499825 -0.0988315 0.0001284 -0.00042 -0.0000677 -0.0149789 -0.5242987 -0.1920187 -0.0000238 -0.2499746 -0.0988546 -0.0001349 -0.0004521 0.0000649 -0.014986 1.383773 0.008279 0.0002942 0.4312396 1.4210929 -0.0008156 0.0004029 0.0000206 0.2828493 1.3838449 -0.0082242 0.0002844 -0.4312155 1.4211662 0.0005616 0.0003774 -0.0001259 0.2828491 -0.1081736 -0.1078532 -0.0000017 0.1273462 0.1403494 0.000037 -0.0001322 0.0000228 -0.0851259 -0.1081135 0.1079019 -0.0000166 -0.1273484 0.1403525 -0.0000327 -0.0000942 -0.0000236 -0.0851217 0.1370924 0.1254153 0.0001718 0.1032321 -0.0493939 0.0000504 0.0001862 0.0000842 -0.126169 0.1370618 -0.1254382 0.0001702 -0.1032451 -0.0494417 -0.0000332 0.000192 -0.0000667 -0.1261758 0.1057137 0.0270563 -0.0000233 -0.0185498 -0.005395 -0.0000026 -0.0000073 0.0000171 0.1602901 0.1057077 -0.0270574 -0.0000262 0.0185485 -0.0054057 0.0000037 -0.0000004 0.0000083 0.1602892 -0.0527217 -0.0703801 -0.0000991 -0.0731741 0.0577452 -0.0000482 -0.0001353 -0.0000846 0.1592923 -0.0527131 0.0703793 -0.0000962 0.0731721 0.0577454 0.0000453 -0.0001349 0.0000658 0.1592951 unknown
polarizability: 171.2808249|0.0001974|135.2087354|0.0182799|0.0020814|42.3397447 unknown
InChI: InChI=1S/C8H4N2O4/c11-7-5-3-1-2-4-6(5)8(12)9(7)10(13)14/h1-4H
charge 0 multiplicity 1
18 atoms
O  -0.837317 2.401024 -0.000311
O  -0.837449 -2.400912 -0.000134
O  -3.308843 1.143399 0.000906
O  -3.308674 -1.143422 0.000489
N  -1.268566 0.000076 -0.00052
N  -2.74542 0.000031 0.000463
C  0.954028 0.706366 -0.000329
C  0.95402 -0.706335 -0.000344
C  -0.445743 1.221215 -0.001244
C  -0.445752 -1.221154 -0.001022
C  2.151296 1.440746 0.000397
C  2.151275 -1.440729 0.000314
C  3.365592 0.709461 0.000989
C  3.365587 -0.709467 0.00098
H  2.136042 2.534746 0.000399
H  2.136009 -2.534731 0.000334
H  4.320364 1.24548 0.001521
H  4.32035 -1.245494 0.001514
