program: Gaussian 09
title: 000138459
version: EM64L-G09RevD.01
frameworkgroup: C1[X(C9H13N)]
method: RPBEPBE
basis: SDD
operation: Freq
keyword: #pfreq=noraman
keyword: PBEPBE/SDD
title: #p freq=noraman PBEPBE/SDD
converged: YES YES NO NO
title: Mulliken charges:
elementType: N C C C C C C C C C H H H H H H H H H H H H H
charge: -0.007468 -0.358428 -0.544145 -0.337477 0.511126 -0.692782 -0.354849 -0.353466 -0.332489 -0.332858 0.207778 0.206973 0.207458 0.207435 0.196259 0.195607 0.212224 0.212061 0.218138 0.233032 0.232927 0.236478 0.236467
chargesum: 0.00000
title: Mulliken charges with hydrogens summed into heavy atoms:
elementType: N C C C C C C C C C
charge: -0.007468 0.056323 -0.129252 0.054388 0.511126 -0.050359 -0.121817 -0.120539 -0.096012 -0.096390
polarizability: 1.28196637e+02 1.04448110e-01 1.00963901e+02 -1.14253525e+01 3.19578262e-01 6.89747580e+01
1716.lowfreq: -33.2436 -7.5652 -5.4661 0.0005 0.0007 0.0011 20.8757 67.9742 74.2211
frequency: -5.2625 67.8052 74.2135 96.4003 205.1727 226.4893 273.1122 331.7715 369.0479 378.3235 522.8855 580.3879 663.7235 731.7228 750.9198 787.7660 802.2732 829.2553 887.1822 900.0217 916.8226 960.9970 964.5994 975.8989 1009.7303 1053.2749 1062.2506 1068.7441 1104.5719 1105.2663 1203.3173 1216.8747 1226.4887 1255.4370 1268.4001 1285.2050 1312.1664 1318.1296 1336.5251 1346.1744 1385.7249 1404.5766 1464.4146 1467.0802 1469.9189 1475.9722 1480.2681 1488.3643 1556.4807 1589.1676 2963.0781 2971.0178 2973.2341 2982.3150 3003.1180 3024.3844 3049.6383 3070.3550 3072.9580 3121.1442 3121.7807 3142.2907 3149.3066
redmass: 2.7349 1.8507 4.2303 2.2046 3.6069 1.0979 4.6272 2.3565 2.4871 3.0965 3.6364 4.2869 6.9065 1.0728 3.5181 1.1767 2.3135 2.0095 1.2473 1.7365 1.2459 6.4625 1.3994 1.4904 4.0635 1.5148 2.1906 2.5769 2.1580 1.3286 1.5296 1.4144 1.8692 1.4629 1.2944 1.0683 5.4191 1.4265 1.2738 1.5620 1.2106 2.0403 1.2536 1.5819 1.0793 1.0427 1.0736 1.0927 6.7265 5.7578 1.0584 1.0575 1.0379 1.0590 1.0991 1.1024 1.1046 1.1009 1.0994 1.0863 1.0884 1.0961 1.0994
irintensity: 0.1742 0.2571 0.5948 0.0080 0.3286 0.0094 0.5539 0.1480 0.0011 0.5164 17.6961 14.8276 0.4770 7.5225 0.6015 0.5562 24.0240 27.4987 0.0351 7.6284 0.9448 3.2903 0.2578 0.0016 2.3462 0.4162 2.2889 3.3867 20.2932 0.9218 0.6432 2.1649 2.6741 3.7296 0.4356 1.0180 1.5482 2.6417 0.7388 0.1061 11.9349 16.3996 1.4849 7.2092 0.2532 13.0117 3.1353 20.3022 12.5650 64.0010 14.4718 10.9680 37.5633 77.7331 2.6368 2.6333 35.5956 85.6250 53.1035 3.4500 13.8724 63.9182 0.3658
temp: 298.150 k
press: 1.00000 atm
elementType: 7 6 6 6 6 6 6 6 6 6 1 1 1 1 1 1 1 1 1 1 1 1 1
symmnumber: 1
zpe: 519753.1 jmol-1
zpe.correction: 0.197964 hartree
zpe.thermalcorrener: 0.207273 hartree
zpe.thermalcorrenthalpy: 0.208217 hartree
zpe.thermalcorrgfe: 0.162768 hartree
zpe.sumelectzpe: -404.743477 hartree
zpe.sumelectthermal: -404.734168 hartree
zpe.sumelectthermalent: -404.733224 hartree
zpe.sumelectthermalfe: -404.778673 hartree
dipole: -3.2855 -0.0298 0.9935
dipole: 3.4326
quadrupole: -73.3277 -54.3466 -64.0287
quadrupole: -0.0972 1.5350 0.1466
quadrupole: -9.4267 9.5544 -0.1277 -0.0972 1.5350 0.1466
hfenergy: -404.9414408 hartree
pointgroup: C01 [X(C9H13N1)]
dipole: 1.2948125 -0.0100146 -0.3836025 debye
dipolederiv: -0.4024655 0.0001207 0.0295975 0.000748 -0.3920297 0.0013091 0.0560837 0.0013473 -0.2650137 0.0118943 -0.0000764 0.0018392 0.0036948 0.1542868 -0.0029003 0.1791906 -0.0041683 0.045217 -0.246844 -0.0013567 -0.0285294 -0.0049102 0.1675686 -0.0005057 -0.173812 -0.0007812 0.113659 0.0524729 -0.0004976 -0.0222256 -0.0041823 0.1831584 -0.0037493 -0.1372751 -0.0025563 0.0953775 0.5321184 -0.0020097 -0.10969 -0.0039099 0.0973654 -0.0018745 -0.1888073 -0.0016676 -0.0172842 -0.0816278 -0.0022786 -0.0609839 -0.00059 0.0908871 -0.0028468 -0.0048616 -0.0030563 0.0227389 -0.3344004 -0.1598725 0.0344469 -0.1370953 -0.0220332 0.0402239 0.0809114 0.053495 -0.1277437 -0.3312594 0.162386 0.0299024 0.1426125 -0.0274727 -0.0431183 0.0766592 -0.0564699 -0.1255553 0.2356983 0.1648709 -0.1013695 0.0326376 0.2822159 -0.0107453 -0.115521 -0.0668236 -0.0356875 0.2337809 -0.166185 -0.0969624 -0.035092 0.2858489 0.0035796 -0.1146757 0.0597236 -0.037777 0.0358465 -0.0370407 0.0174028 -0.0317412 -0.065074 0.1267371 0.025174 0.0928056 -0.0326354 0.0359963 0.0376797 0.014977 0.0332907 -0.0768996 -0.1245872 0.0234528 -0.090228 -0.0214005 0.0302084 0.0143993 0.0303701 0.0370067 -0.0769195 -0.134355 0.035321 -0.0715057 -0.0081989 0.0295145 -0.0137186 0.032514 -0.0348911 -0.0668028 0.1367256 0.0378504 0.073981 -0.0176925 0.0257565 0.0022574 -0.0055753 0.0405401 -0.0969025 -0.1467271 0.0231014 -0.1199398 -0.0381853 0.026887 -0.0022912 -0.006264 -0.0381685 -0.0784986 0.1499156 0.0249771 0.1229223 -0.0578596 0.0908373 -0.0526299 0.0257367 -0.010412 -0.0759602 0.1397439 -0.0219183 0.1107942 -0.0280511 0.090338 0.0554313 0.0224597 0.0096471 -0.0941852 -0.1345794 -0.0219811 -0.1054864 -0.0093949 -0.2303067 0.0012405 0.0450275 0.001667 0.1014044 -0.0017262 0.0641397 -0.0016192 0.0521448 0.058609 0.1080374 0.0420538 0.0803185 -0.0571546 -0.0254183 0.0391233 -0.0372616 0.126017 0.0568839 -0.1078645 0.0450644 -0.0807871 -0.0536556 0.0297152 0.0416125 0.0413423 0.1240484 0.0391775 -0.0900648 0.0313611 -0.0803202 -0.0880528 0.0279941 0.0368235 0.0364138 0.1208496 0.0408841 0.0894629 0.0288468 0.0799367 -0.0910942 -0.0228107 0.0344316 -0.0312614 0.1224274 unknown
polarizability: 128.3231539|-0.0649239|100.9640315|-11.092089|-0.3166784|68.8481104 unknown
InChI: InChI=1S/C9H13N/c1-2-3-4-9-5-7-10-8-6-9/h5-8H,2-4H2,1H3
charge 0 multiplicity 1
23 atoms
N  -3.167358 0.013041 0.548174
C  1.979004 0.001069 0.194223
C  0.953005 -0.026243 -0.974251
C  3.44278 -0.013997 -0.300688
C  -0.482789 -0.013274 -0.480935
C  4.462965 0.030695 0.857313
C  -1.182916 -1.214872 -0.200186
C  -1.171548 1.201936 -0.23204
C  -2.501135 -1.155815 0.304702
C  -2.48994 1.168764 0.274521
H  1.800739 -0.869229 0.857654
H  1.804076 0.904841 0.812147
H  1.13603 -0.931524 -1.585542
H  1.137791 0.84932 -1.62702
H  3.612516 -0.923683 -0.912343
H  3.608645 0.850389 -0.97601
H  4.337467 -0.837631 1.531262
H  4.333658 0.946805 1.463752
H  5.502109 0.0184 0.480364
H  -0.709891 -2.188016 -0.377184
H  -0.689308 2.165577 -0.43442
H  -3.058212 -2.074167 0.524238
H  -3.037987 2.097815 0.47047
