program: Gaussian 09
title: 000138458
version: EM64L-G09RevD.01
frameworkgroup: C1[X(C16H18O)]
method: RPBEPBE
basis: SDD
operation: Freq
keyword: #pfreq=noraman
keyword: PBEPBE/SDD
title: #p freq=noraman PBEPBE/SDD
converged: YES YES NO NO
title: Mulliken charges:
elementType: O C C C C C C C C C C C C C C C C H H H H H H H H H H H H H H H H H H
charge: -0.467953 0.021559 -0.439593 0.367601 0.384326 -0.355619 -0.359829 -0.389607 -0.431866 -0.405192 -0.703014 -0.229714 -0.236387 -0.242486 -0.225271 -0.242189 -0.246326 0.199284 0.196168 0.222767 0.213372 0.342572 0.266369 0.240260 0.249382 0.286235 0.205827 0.207058 0.220741 0.226603 0.222949 0.224698 0.223124 0.228817 0.225336
chargesum: 0.00000
title: Mulliken charges with hydrogens summed into heavy atoms:
elementType: O C C C C C C C C C C C C C C C C
charge: -0.125381 0.021559 -0.044141 0.367601 0.384326 0.080520 -0.093460 -0.149348 -0.182484 -0.118957 -0.069389 -0.003111 -0.013437 -0.017789 -0.002148 -0.013373 -0.020990
polarizability: 1.97068210e+02 -1.19536786e+01 1.60569696e+02 1.43973055e+01 -6.23936815e+00 1.44564421e+02
1716.lowfreq: -8.3553 -7.9891 -0.0006 -0.0005 -0.0002 10.2448 30.7398 39.7162 59.8575
frequency: 30.6957 39.5285 59.8521 66.7659 88.1121 105.6467 163.3952 209.1945 229.7828 238.5599 277.5130 278.8738 296.4687 311.1964 339.3724 354.4194 400.6489 402.5040 437.2174 497.8377 542.3096 598.9421 615.8163 616.8642 637.8044 702.1412 705.1190 708.6643 752.9581 764.4666 780.4094 836.1177 855.1190 858.7029 875.7782 907.2386 926.9298 932.9587 949.0483 980.1823 980.8301 990.3070 990.5408 997.7662 997.9104 1023.2019 1027.3815 1041.7110 1061.0605 1079.9713 1098.1687 1110.7318 1118.9477 1152.5073 1170.8357 1171.9649 1188.3813 1192.9364 1200.2753 1228.1841 1275.7955 1294.1288 1311.4093 1320.3016 1338.2321 1353.2284 1380.3325 1381.9495 1390.0354 1433.3800 1434.6290 1456.5102 1476.1213 1478.1140 1480.6837 1481.9151 1488.4610 1589.3338 1591.7138 1609.5232 1613.5867 2956.8480 2969.2555 2995.8082 3014.2825 3042.7967 3071.4344 3071.7066 3117.5624 3122.9270 3126.3419 3132.1722 3139.7689 3146.5763 3154.4588 3157.5406 3165.6709 3177.0063 3562.1507
redmass: 3.7535 3.8072 4.2784 3.2479 2.2909 2.5659 2.7335 4.4029 2.5443 1.4756 4.3029 2.8355 1.5402 2.6211 3.4093 3.5557 2.8125 2.8476 4.0051 3.3758 4.0649 3.6092 6.3637 6.3984 5.3647 3.7441 1.7174 1.8371 1.1489 1.8970 2.0975 2.0196 1.2493 1.2523 2.5160 1.5379 1.5526 1.5284 2.1786 1.3806 1.4077 5.6802 5.9222 1.3221 1.3238 2.8381 2.2112 2.9428 2.2354 1.5694 1.7276 2.0229 1.9717 1.8704 1.0581 1.0572 1.1489 1.1322 3.3455 1.3736 1.3506 1.2389 1.3603 1.3411 1.5235 1.6066 6.5632 8.5734 1.2258 2.2154 2.2324 1.1004 1.0479 1.0580 2.2077 2.1082 1.0955 6.0046 6.3201 6.0163 6.0523 1.0601 1.0362 1.0602 1.0981 1.1007 1.1016 1.0993 1.0853 1.0846 1.0879 1.0881 1.0938 1.0924 1.0954 1.0989 1.1010 1.0954 1.0658
irintensity: 0.2119 0.0671 0.1675 0.0899 0.1389 0.4048 0.5737 0.6907 4.2003 2.3717 8.5459 10.5397 81.8632 15.3333 31.9267 30.4062 1.5388 0.6591 3.2741 0.4639 3.4651 23.6825 0.8300 0.2050 23.2435 7.1196 59.6564 57.8287 9.9770 49.0584 37.6036 16.6387 0.1262 0.2563 10.6693 16.1892 0.8215 3.9718 18.6319 0.2165 0.4553 0.1922 0.4190 0.5209 1.1327 6.2619 15.2761 8.1825 9.3099 5.2026 7.5318 12.1358 17.6707 37.0560 0.4568 0.1942 2.7811 2.2751 18.2832 4.8089 5.8032 6.4978 0.5980 0.9228 25.6954 11.7168 1.6715 2.3158 10.9082 5.7839 23.6665 0.8842 4.1694 15.6528 20.6449 7.1973 9.5125 1.6769 0.2168 7.1579 2.9880 30.3332 46.4593 21.5413 15.5870 0.4642 72.0345 54.5532 4.2140 0.8591 3.8075 6.9898 34.5660 23.1834 30.4629 30.4299 17.0395 7.0169 6.8669
temp: 298.150 k
press: 1.00000 atm
elementType: 8 6 6 6 6 6 6 6 6 6 6 6 6 6 6 6 6 1 1 1 1 1 1 1 1 1 1 1 1 1 1 1 1 1 1
symmnumber: 1
zpe: 768615.4 jmol-1
zpe.correction: 0.292750 hartree
zpe.thermalcorrener: 0.308741 hartree
zpe.thermalcorrenthalpy: 0.309685 hartree
zpe.thermalcorrgfe: 0.248543 hartree
zpe.sumelectzpe: -694.486442 hartree
zpe.sumelectthermal: -694.470451 hartree
zpe.sumelectthermalent: -694.469507 hartree
zpe.sumelectthermalfe: -694.530649 hartree
dipole: -1.1696 0.8235 -0.7232
dipole: 1.6028
quadrupole: -95.4397 -97.4440 -98.2875
quadrupole: -2.8553 0.7667 -0.2519
quadrupole: 1.6174 -0.3869 -1.2304 -2.8553 0.7667 -0.2519
hfenergy: -694.7791919 hartree
pointgroup: C01 [X(C16H18O1)]
dipole: 0.4778731 -0.2926389 -0.2892472 debye
polarizability: 198.1186047|-9.2512158|159.1357086|-15.5862306|5.1706118|144.9480135 unknown
InChI: InChI=1S/C16H18O/c1-2-13-16(17,14-9-5-3-6-10-14)15-11-7-4-8-12-15/h3-12,17H,2,13H2,1H3
charge 0 multiplicity 1
35 atoms
O  -0.108404 -0.863504 1.95111
C  -0.014714 -0.677728 0.474018
C  -0.389759 -2.020445 -0.22322
C  1.419593 -0.205252 0.145028
C  -1.042119 0.414646 0.124197
C  -1.786001 -2.560339 0.15149
C  1.937996 0.901063 0.871586
C  -1.044744 0.980268 -1.175917
C  2.242547 -0.821551 -0.829416
C  -2.010532 0.843171 1.062963
C  -2.058219 -3.942877 -0.478216
C  3.2432 1.37581 0.632288
C  -2.003305 1.952499 -1.534458
C  3.55342 -0.345983 -1.071749
C  -2.96684 1.82177 0.705835
C  4.058936 0.752318 -0.343095
C  -2.970507 2.3781 -0.593383
H  -0.342713 -1.882376 -1.322068
H  0.377265 -2.780019 0.038274
H  -2.560216 -1.842217 -0.178616
H  -1.865516 -2.621221 1.253411
H  0.64497 -1.44594 2.225038
H  1.301159 1.380796 1.622591
H  -0.283456 0.674618 -1.90401
H  1.872814 -1.675054 -1.406012
H  -1.99858 0.410288 2.066535
H  -1.321683 -4.694055 -0.133842
H  -2.000511 -3.899144 -1.582769
H  -3.064806 -4.311979 -0.209295
H  3.625874 2.230973 1.200885
H  -1.991026 2.383517 -2.542096
H  4.176744 -0.834451 -1.829473
H  -3.709578 2.147627 1.443266
H  5.073721 1.120155 -0.532051
H  -3.71241 3.136215 -0.868828
