program: Gaussian 09
title: 000138457
version: EM64L-G09RevD.01
frameworkgroup: C1[X(C7H11NO2)]
method: RPBEPBE
basis: SDD
operation: Freq
keyword: #p
keyword: freq=noraman
keyword: PBEPBE/SDD
title: #p freq=noraman PBEPBE/SDD
converged: YES YES NO NO
title: Mulliken charges:
elementType: O O N C C C C C C C H H H H H H H H H H H
charge: -0.205347 -0.198482 0.151041 -0.409536 -0.489027 -0.411071 -0.429720 0.432164 -0.340466 -0.548258 0.210759 0.203244 0.243918 0.214857 0.211000 0.210473 0.217516 0.222707 0.217138 0.245479 0.251610
chargesum: 0.00000
title: Mulliken charges with hydrogens summed into heavy atoms:
elementType: O O N C C C C C C C
charge: -0.205347 -0.198482 0.151041 0.004467 -0.030251 0.010402 0.010503 0.432164 -0.123328 -0.051170
polarizability: 1.03315065e+02 -5.07627757e+00 9.59991152e+01 -4.35022551e-01 1.38543681e+00 6.55499479e+01
1716.lowfreq: -12.0910 -6.6805 -0.0009 -0.0005 0.0003 11.5380 34.8664 51.5870 84.0483
frequency: 34.8271 51.4593 84.0339 154.8859 241.8225 287.1565 301.0353 399.5579 441.3398 441.9770 504.8118 552.6316 620.9377 730.1907 758.0214 789.6727 810.1191 852.3131 867.2520 899.2641 920.5726 965.1019 987.4711 1066.4029 1077.2482 1105.8653 1132.0994 1156.1366 1160.8987 1183.0584 1212.5735 1238.8317 1264.3711 1308.8647 1318.7069 1335.2543 1338.1100 1347.9780 1374.5226 1426.1783 1447.0959 1449.9984 1457.6477 1469.3319 1475.3760 1676.8156 2955.7651 2968.8919 2981.5875 2985.3336 3011.4534 3014.8656 3031.5534 3045.1920 3053.7376 3097.8657 3122.6542
redmass: 7.6637 4.4600 3.6095 2.7899 2.4202 2.7739 2.4834 3.2662 2.2991 2.2438 4.1576 4.9015 3.0429 3.8080 2.7275 2.1114 2.1295 2.6055 1.8564 2.3061 1.3649 2.6906 1.8705 2.0150 1.8854 1.4368 1.1783 2.6451 1.3181 1.4152 3.6730 1.3082 1.2043 1.4639 1.2816 1.4154 1.7252 1.5328 1.8299 4.8225 1.1060 1.0996 1.0876 1.0870 1.0914 6.6217 1.0643 1.0601 1.0665 1.0638 1.0918 1.0963 1.0588 1.0986 1.1041 1.0915 1.1058
irintensity: 0.2943 1.3390 2.3255 1.7146 1.2366 1.1168 0.7489 0.7094 4.9516 0.9005 1.2862 7.9115 26.0553 6.9258 3.6410 0.8081 7.7631 4.5137 4.5923 6.0379 4.9648 3.2410 1.2843 1.5689 0.5818 1.7836 7.8323 5.1147 20.1038 13.1858 77.1732 0.8259 3.0075 23.6192 0.7249 2.5263 3.0131 0.9351 8.3694 131.4773 24.7151 2.1572 27.0734 10.9020 8.2335 7.4906 31.6612 22.7436 27.9543 23.6395 51.4883 14.7420 19.0383 51.7630 61.7128 20.5573 4.8214
temp: 298.150 k
press: 1.00000 atm
elementType: 8 8 7 6 6 6 6 6 6 6 1 1 1 1 1 1 1 1 1 1 1
symmnumber: 1
zpe: 454513.5 jmol-1
zpe.correction: 0.173115 hartree
zpe.thermalcorrener: 0.182768 hartree
zpe.thermalcorrenthalpy: 0.183713 hartree
zpe.thermalcorrgfe: 0.136837 hartree
zpe.sumelectzpe: -477.667359 hartree
zpe.sumelectthermal: -477.657706 hartree
zpe.sumelectthermalent: -477.656762 hartree
zpe.sumelectthermalfe: -477.703637 hartree
dipole: 3.6646 -0.5924 2.3770
dipole: 4.4080
quadrupole: -66.7608 -60.2821 -59.0510
quadrupole: 0.0947 -7.3054 -0.4447
quadrupole: -4.7295 1.7492 2.9803 0.0947 -7.3054 -0.4447
hfenergy: -477.8404744 hartree
pointgroup: C01 [X(C7H11N1O2)]
dipole: -1.4490338 0.2071507 0.9300388 debye
dipolederiv: -0.3621823 0.0720122 0.1342408 -0.0110523 -0.7718232 -0.016807 0.2263694 -0.208081 -0.356155 -0.4812199 -0.1984958 0.1365323 -0.2321675 -0.6465386 -0.0058027 0.3679444 0.0954585 -0.3607734 0.5297066 0.1548914 -0.4365983 0.2153312 1.1846984 0.0450471 -0.7327979 0.1248265 0.5265543 0.1106585 0.0388849 -0.0199734 -0.0062741 0.0536796 0.0367637 -0.0439935 0.036276 0.137291 -0.0769987 0.0084449 -0.0503414 -0.0324802 -0.0145689 -0.0388791 -0.0601002 -0.0824806 0.1382287 0.0965693 0.0106583 -0.0431694 0.0426811 0.0175466 0.0111806 -0.011215 0.0233353 0.104353 -0.0446258 0.0143719 -0.0995737 0.082455 0.005312 -0.0136175 -0.0624677 -0.0483278 0.1721834 0.0342742 0.0991387 0.0140743 0.1916519 0.1349352 0.0398132 0.1207645 0.1008257 -0.2212698 0.174819 -0.0678112 0.1568692 -0.1220182 0.0421114 0.0105555 0.1167217 -0.0110432 -0.1634041 0.1553664 -0.1153169 0.1616661 -0.0510915 0.0969045 -0.0222589 0.0133115 -0.0451658 0.1716324 0.0029832 -0.0740563 -0.0354144 -0.099154 -0.1440952 -0.0728413 -0.0607284 -0.0951802 0.0411025 -0.0118782 -0.00075 0.0704995 0.0484257 0.0712207 -0.0189539 0.1063382 0.0349596 -0.1433741 0.0408355 -0.002015 0.0625808 0.0178105 0.0303486 -0.0384459 0.0925271 -0.0733675 -0.0515359 0.0260213 0.0437156 -0.0765732 0.0474025 -0.0454693 0.0870841 -0.0761784 0.1310556 -0.0340083 -0.2195898 0.0052077 -0.0826713 0.0041432 0.0560073 0.0004725 -0.0581113 0.0011093 0.0649755 0.0556924 0.0025512 0.1268581 -0.0066244 0.0239998 -0.0147356 0.0582494 -0.004956 -0.1335156 -0.0838589 0.0757797 0.0786139 -0.018631 0.0839203 -0.0445216 0.0896629 -0.0693018 -0.0647083 0.0289802 0.0073466 -0.0121094 -0.0087107 -0.0904104 0.0962228 -0.0802743 0.1406924 0.0044521 -0.0104369 -0.1013305 -0.0824531 -0.0952724 -0.0541874 -0.0563979 -0.0606632 -0.0605367 0.0943604 0.0229066 0.0517595 -0.0099148 0.1048838 -0.0124292 0.108963 0.0110381 0.03523 0.0196792 0.0119772 -0.0249871 0.0068575 -0.0713085 -0.0211622 -0.092841 0.0436025 -0.0253281 0.053932 unknown
polarizability: 102.9587811|-5.3393419|96.3757667|0.6024189|0.9260496|65.5295805 unknown
InChI: InChI=1S/C7H11NO2/c9-8(10)6-7-4-2-1-3-5-7/h4H,1-3,5-6H2
charge 0 multiplicity 1
21 atoms
O  2.455528 -1.340845 -0.531786
O  2.920282 0.894292 -0.574862
N  2.317942 -0.136016 -0.098161
C  -2.236994 -1.232492 0.010284
C  -0.698069 -1.291939 0.160382
C  -2.664499 0.005933 -0.809706
C  -2.225745 1.308964 -0.100547
C  -0.107213 0.059753 0.538628
C  -0.807607 1.224833 0.428739
C  1.316557 0.087729 1.058204
H  -2.600888 -2.159611 -0.470629
H  -2.70501 -1.181917 1.013851
H  -0.235583 -1.647098 -0.78302
H  -0.416869 -2.044685 0.924059
H  -3.75979 0.010153 -0.964367
H  -2.195496 -0.042449 -1.81226
H  -2.914465 1.537526 0.740942
H  -2.305028 2.17116 -0.792351
H  -0.33198 2.168292 0.734701
H  1.518185 -0.733119 1.768026
H  1.586642 1.062037 1.492071
