program: Gaussian 09
title: 000138456
version: EM64L-G09RevD.01
frameworkgroup: C1[X(C8H16ClNO)]
method: RPBEPBE
basis: SDD
operation: Freq
keyword: #p
keyword: freq=noraman
keyword: PBEPBE/SDD
title: #p freq=noraman PBEPBE/SDD
converged: YES YES NO NO
title: Mulliken charges:
elementType: Cl O N C C C C C C C C H H H H H H H H H H H H H H H H
charge: -0.089041 -0.267610 -0.347147 -0.370492 -0.356021 -0.344521 -0.354661 -0.397013 -0.693111 0.281757 -0.652393 0.192728 0.187455 0.218406 0.199675 0.192570 0.186607 0.214730 0.258420 0.195946 0.194157 0.209871 0.211007 0.216904 0.322699 0.294024 0.295055
chargesum: 0.00000
title: Mulliken charges with hydrogens summed into heavy atoms:
elementType: Cl O N C C C C C C C C
charge: -0.089041 -0.267610 -0.024448 0.009691 0.062060 0.034656 0.035441 0.076137 -0.055329 0.281757 -0.063313
polarizability: 1.23520290e+02 -3.56453839e+00 1.11026858e+02 8.54520779e+00 -5.42460600e+00 8.42634694e+01
1716.lowfreq: -9.7689 -0.0010 0.0009 0.0016 6.7417 8.8150 13.2409 29.4622 55.1419
frequency: 12.1159 29.3579 54.9599 71.2712 89.6228 110.8901 127.4828 143.8757 184.3288 218.4650 232.4156 308.9388 339.6725 378.3354 402.5556 494.5705 569.0809 597.3418 660.9516 664.7893 724.3905 745.8369 801.3855 857.3390 886.6034 906.1744 911.9453 946.0137 998.4180 1030.8146 1061.6958 1077.8365 1105.6275 1123.2245 1137.3918 1149.9727 1202.1507 1229.6403 1250.9391 1253.5167 1257.3230 1281.3648 1290.2819 1293.8605 1316.7156 1349.7475 1353.8793 1364.1323 1392.8607 1418.1163 1456.8165 1461.4185 1464.4718 1470.0372 1478.1621 1480.0130 1488.0988 1513.2788 1613.1470 2948.1614 2956.7587 2968.2349 2973.5101 2977.8733 2987.5603 2989.1869 3004.4758 3029.2339 3046.5002 3069.7031 3072.3594 3073.0562 3073.9441 3154.9792 3511.7680
redmass: 5.8579 5.5269 1.5854 3.6707 2.6815 3.9350 1.7580 2.5443 4.1147 4.4864 1.1310 2.4781 3.6383 6.6933 3.2984 2.3957 3.2496 3.8332 1.1261 5.6790 1.0867 1.2363 1.5348 1.5746 2.0938 1.7272 2.3192 1.7391 1.6075 2.9369 2.3758 2.3872 3.1449 2.5327 1.6780 1.1987 1.5040 1.3553 1.5982 1.2906 1.2810 1.2783 1.0750 1.1346 1.2818 1.4872 1.5440 1.3705 1.2168 1.0910 1.0793 1.0943 1.0713 1.0747 1.0419 1.0757 1.0871 1.9564 8.2566 1.0588 1.0590 1.0593 1.0365 1.0612 1.0877 1.0747 1.1008 1.1033 1.1018 1.1007 1.0574 1.0992 1.0985 1.1095 1.0774
irintensity: 1.4032 0.5402 0.2738 8.0753 7.6257 0.7496 0.4462 1.9072 6.7187 6.5723 0.2103 6.7345 1.9069 7.6959 3.9290 2.2082 5.7414 5.9126 115.5753 68.9085 17.8164 2.5433 9.7137 2.1414 5.5017 9.1507 1.2713 1.3062 1.3283 3.4801 13.2022 4.1905 4.8972 4.6097 3.5107 0.0576 2.0179 1.9031 17.3148 16.3709 6.3508 35.3845 4.0624 3.4545 12.1929 0.2821 0.3579 4.6344 12.2538 28.8065 4.2392 26.0252 2.4923 0.5217 12.7852 6.0519 21.1113 206.0692 239.6197 9.3853 8.5994 65.7298 32.7814 62.2619 16.9855 19.6327 0.4248 15.6021 99.0502 91.5709 3.1640 49.7771 10.6121 1.3320 39.8769
temp: 298.150 k
press: 1.00000 atm
elementType: 17 8 7 6 6 6 6 6 6 6 6 1 1 1 1 1 1 1 1 1 1 1 1 1 1 1 1
symmnumber: 1
zpe: 608139.4 jmol-1
zpe.correction: 0.231628 hartree
zpe.thermalcorrener: 0.245519 hartree
zpe.thermalcorrenthalpy: 0.246463 hartree
zpe.thermalcorrgfe: 0.187464 hartree
zpe.sumelectzpe: -903.599595 hartree
zpe.sumelectthermal: -903.585704 hartree
zpe.sumelectthermalent: -903.584760 hartree
zpe.sumelectthermalfe: -903.643759 hartree
dipole: -2.1238 0.7780 -1.1621
dipole: 2.5429
quadrupole: -78.3215 -83.7193 -74.7056
quadrupole: 5.8544 -0.6034 4.5317
quadrupole: 0.5939 -4.8038 4.2099 5.8544 -0.6034 4.5317
hfenergy: -903.8312229 hartree
pointgroup: C01 [X(C8H16Cl1N1O1)]
dipole: -0.8584578 -0.0418451 0.5120781 debye
polarizability: 124.0399983|-1.1406124|103.2728699|-9.1938879|-12.652295|91.4977492 unknown
InChI: InChI=1S/C8H16ClNO/c1-2-3-4-5-6-10-8(11)7-9/h10H,2-7H2,1H3
charge 0 multiplicity 1
27 atoms
Cl 2.592812 -2.3926 1.293528
O  3.032926 0.857083 -1.137035
N  1.430777 0.298245 0.479083
C  -1.696123 0.322889 0.425548
C  -0.746773 1.233539 -0.386074
C  -3.073093 0.135173 -0.251147
C  -4.033349 -0.768187 0.556008
C  0.608643 1.509715 0.304417
C  -5.407998 -0.943639 -0.12476
C  2.562044 0.069036 -0.256279
C  3.342778 -1.22416 -0.007906
H  -1.230704 -0.674572 0.570702
H  -1.842844 0.754949 1.438397
H  -0.558596 0.790785 -1.383585
H  -1.241221 2.211164 -0.559522
H  -2.929024 -0.29614 -1.263636
H  -3.545595 1.128525 -0.401361
H  0.437512 1.968184 1.298423
H  1.209806 2.210856 -0.300134
H  -3.562471 -1.7617 0.702809
H  -4.173074 -0.337694 1.568766
H  -5.913424 0.031956 -0.25511
H  -5.299092 -1.40047 -1.126542
H  -6.075391 -1.592716 0.471338
H  1.146277 -0.417164 1.154175
H  3.399325 -1.807374 -0.938166
H  4.353573 -0.983484 0.352061
