program: Gaussian 09
title: 000138455
version: EM64L-G09RevD.01
frameworkgroup: C1[X(C7H6INO2)]
method: RPBEPBE
basis: SDD
operation: Freq
keyword: #p
keyword: freq=noraman
keyword: PBEPBE/SDD
title: #p freq=noraman PBEPBE/SDD
converged: YES YES NO NO
title: Mulliken charges:
elementType: I O O N C C C C C C C H H H H H H
charge: 0.184769 -0.202084 -0.180522 0.007559 0.481644 -0.526852 0.527456 -0.358195 -0.519107 -0.125492 -0.795611 0.290242 0.246435 0.257730 0.235878 0.236386 0.239766
chargesum: 0.00000
title: Mulliken charges with hydrogens summed into heavy atoms:
elementType: I O O N C C C C C C C
charge: 0.184769 -0.202084 -0.180522 0.007559 0.481644 -0.236611 0.527456 -0.111760 -0.519107 0.132238 -0.083581
polarizability: 1.75973274e+02 4.51476656e+00 1.21609621e+02 3.44474968e+00 -1.50773597e+00 4.68480739e+01
1716.lowfreq: -7.9756 -1.3416 -0.0007 -0.0004 0.0003 3.9944 32.1010 38.8568 80.3966
frequency: 32.0021 38.8452 80.3941 146.0547 155.8628 197.6433 243.1217 282.6964 353.0020 385.9846 419.8673 485.6953 531.4583 596.6869 656.2970 670.9307 727.6832 741.7625 829.2197 887.2792 911.2162 973.7178 995.7364 1006.4170 1051.1117 1104.6697 1150.9010 1203.3488 1225.3065 1265.3158 1358.5965 1370.3200 1398.1829 1402.7865 1462.7881 1469.7653 1472.5609 1562.7586 1604.6045 2984.5192 3063.5216 3097.2773 3136.0522 3166.5521 3169.6390
redmass: 1.1083 7.9165 4.0011 11.9991 5.9373 5.2758 7.2774 4.2436 4.5734 7.0378 3.6714 4.0431 4.7789 5.7813 7.8174 4.8735 5.1204 9.5567 1.3017 5.1363 1.4019 1.3563 2.9157 2.0588 1.5660 2.3388 1.4591 9.9421 2.3585 1.5021 3.0720 10.6969 5.2272 1.2316 2.7842 1.0765 1.0918 6.1427 6.2574 1.0379 1.0974 1.0989 1.0897 1.0939 1.0939
irintensity: 0.4190 0.3811 0.5703 1.1857 0.1393 0.6915 2.5324 0.5856 0.1529 2.0143 0.6417 14.9508 10.7941 6.6020 7.4866 1.8523 4.1247 20.0958 34.5340 8.5458 8.7474 1.4233 24.7278 25.8965 15.3495 10.6476 4.3690 205.6392 31.7854 3.1824 6.1659 90.2021 29.2689 11.2013 104.3695 14.6815 11.2955 10.8997 1.2381 24.5130 15.5766 13.2838 7.6193 1.6110 6.6832
temp: 298.150 k
press: 1.00000 atm
elementType: 53 8 8 7 6 6 6 6 6 6 6 1 1 1 1 1 1
symmnumber: 1
zpe: 305467.3 jmol-1
zpe.correction: 0.116346 hartree
zpe.thermalcorrener: 0.126964 hartree
zpe.thermalcorrenthalpy: 0.127908 hartree
zpe.thermalcorrgfe: 0.076853 hartree
zpe.sumelectzpe: -486.164560 hartree
zpe.sumelectthermal: -486.153943 hartree
zpe.sumelectthermalent: -486.152999 hartree
zpe.sumelectthermalfe: -486.204054 hartree
dipole: -3.3285 -4.8569 -0.0052
dipole: 5.8880
quadrupole: -62.8539 -84.0904 -80.5389
quadrupole: 2.8040 -2.1455 0.5317
quadrupole: 12.9739 -8.2627 -4.7112 2.8040 -2.1455 0.5317
hfenergy: -486.2809069 hartree
pointgroup: C01 [X(C7H6I1N1O2)]
dipole: -2.1746602 -0.7958258 0.0612314 debye
dipolederiv: -0.2096664 0.2609144 0.0243376 0.2460742 -0.1054074 0.0015595 0.0444568 -0.0190478 0.0680527 -0.4457174 -0.1381029 -0.0368776 -0.059962 -0.8460718 0.2289984 -0.0558744 0.2220678 -0.3272789 -0.6963097 -0.0590631 -0.1877151 -0.0166465 -0.4012372 0.1039379 -0.1364571 0.1243826 -0.2999875 1.2172955 0.5448068 0.2511555 0.251687 1.2026115 -0.3997152 0.1924582 -0.3807183 0.4046604 0.3927134 -0.3482919 -0.0052551 -0.2148366 -0.1226929 0.0079625 -0.0120839 0.0236575 -0.0132222 -0.0656948 0.2795615 -0.014742 -0.011552 -0.0903053 -0.0064675 0.0539529 0.0366616 -0.1228897 -0.4619324 -0.1766845 -0.0168461 -0.2262958 -0.2608847 0.0563718 0.0234466 0.0050855 0.0956448 0.0809994 0.0683759 -0.0098591 0.0429567 0.1214352 -0.0055075 -0.0088182 -0.000252 -0.1397994 0.6720711 -0.6914112 -0.0511931 -0.2157151 0.3862301 0.0264923 -0.1147748 0.0155244 -0.1638169 -0.4822121 0.2179355 0.0197307 0.1787806 0.0159305 -0.009319 0.0122152 -0.0121536 -0.0795977 -0.1685165 0.1097692 0.0060764 0.0288011 0.0532867 -0.001421 0.0346782 -0.0295378 0.0531749 0.0996762 0.0191052 0.0061282 0.0263813 0.0232133 -0.0042325 -0.0272307 0.0032239 0.163889 -0.0709165 -0.0627071 0.0084229 -0.060798 0.0546935 0.0024383 0.0002917 0.0012861 0.1514036 0.0915616 0.0147688 0.0014558 -0.0084741 -0.0498176 0.0027459 0.007107 -0.0006767 0.1547335 0.0722229 -0.0851991 0.0118903 0.030842 -0.1133992 0.0231698 -0.0051851 0.0291542 0.1118122 -0.0238433 0.0088112 -0.0858191 -0.017774 0.055611 -0.0796344 -0.1301362 -0.0294085 -0.0033757 -0.001731 0.0374109 0.0791098 0.0265313 0.0768043 0.0526209 0.1219538 0.0107511 -0.0534031 unknown
polarizability: 161.980082|-24.2755834|135.4641609|0.0881196|-4.733858|46.9867263 unknown
InChI: InChI=1S/C7H6INO2/c1-5-2-3-6(8)7(4-5)9(10)11/h2-4H,1H3
charge 0 multiplicity 1
17 atoms
I  2.187955 -2.4165 -0.077735
O  1.571191 2.25733 -0.585776
O  2.750087 0.602236 0.446579
N  1.667629 1.079291 -0.060357
C  -2.027905 0.300185 0.016903
C  -0.787008 0.965572 -0.034345
C  0.434379 0.245925 -0.027729
C  -2.01333 -1.119721 0.054958
C  0.445894 -1.171732 0.008322
C  -0.803066 -1.840278 0.040342
C  -3.334533 1.06941 0.033826
H  -0.731915 2.057127 -0.081785
H  -2.959483 -1.672249 0.089728
H  -0.823467 -2.933771 0.052071
H  -3.170771 2.152077 -0.094277
H  -4.008391 0.73007 -0.774078
H  -3.871266 0.92053 0.989553
