program: Gaussian 09
title: 000138453
version: EM64L-G09RevD.01
frameworkgroup: C1[X(C5H9N3O6)]
method: RPBEPBE
basis: SDD
operation: Freq
keyword: #pfreq=noraman
keyword: PBEPBE/SDD
title: #p freq=noraman PBEPBE/SDD
converged: NO YES NO NO
title: Mulliken charges:
elementType: O O O O O O N N N C C C C C H H H H H H H H H
charge: -0.186288 -0.162875 -0.149048 -0.154958 -0.161473 -0.174151 0.091225 0.092986 0.101205 0.230862 0.283028 -0.720425 -0.701914 -0.702088 0.241851 0.256082 0.260239 0.231556 0.274137 0.254557 0.279013 0.241695 0.274785
chargesum: 0.00000
title: Mulliken charges with hydrogens summed into heavy atoms:
elementType: O O O O O O N N N C C C C C
charge: -0.186288 -0.162875 -0.149048 -0.154958 -0.161473 -0.174151 0.091225 0.092986 0.101205 0.230862 0.283028 0.037747 0.058336 0.093404
polarizability: 9.89456798e+01 1.76703617e+00 1.01441589e+02 4.26467733e+00 3.02289734e+00 9.81903147e+01
1716.lowfreq: -20.4379 -11.5219 -8.8221 -0.0008 -0.0005 0.0001 27.5934 46.6648 87.4957
frequency: 27.4590 46.6156 87.4460 95.9321 137.5567 151.2339 174.7281 190.6823 200.3729 225.4925 234.6917 293.0258 306.5758 313.8275 325.7677 341.3440 355.5303 385.7286 426.4061 467.7925 512.0896 543.4440 611.2378 651.4225 679.6394 701.7071 750.1898 753.8556 760.9154 820.0300 921.5715 945.0481 1006.3298 1073.6206 1088.9957 1133.5021 1140.7481 1175.6261 1195.4327 1204.4248 1221.4456 1232.7010 1379.7754 1392.6551 1404.5509 1413.2144 1430.0079 1430.9246 1453.6229 1458.2575 1464.8473 1472.9163 1484.1763 1490.1145 3019.0008 3025.1665 3025.7011 3114.3196 3121.6962 3124.0559 3138.9525 3143.3803 3149.0101
redmass: 8.1994 10.6006 4.3941 13.6761 2.1564 1.9773 5.4565 1.3760 1.8314 2.1493 4.5846 2.6525 3.5314 3.8860 4.7251 3.0622 3.4823 9.3391 4.5636 4.5371 4.8188 5.2335 9.3369 5.3182 4.6521 6.3075 10.0436 8.3025 7.1826 3.4298 2.5514 1.4265 1.3058 2.1757 1.7901 1.9755 2.4526 13.0260 3.5653 9.3500 5.5768 5.5180 1.2791 1.6259 1.3420 3.6204 2.7926 3.9930 1.1003 1.0928 1.0542 1.2166 1.0771 1.0751 1.0364 1.0368 1.0373 1.0991 1.0981 1.0995 1.1008 1.1012 1.1005
irintensity: 0.8421 0.7557 1.4934 0.2462 1.1164 1.8132 2.9843 2.5169 1.9520 3.0525 4.9315 0.0227 0.0551 0.4468 2.0217 1.4136 3.2324 1.7570 4.8047 3.8432 0.6399 1.8415 0.8662 0.1603 1.1154 6.6450 1.5383 50.5771 62.3895 0.8429 0.2740 3.3322 0.3101 4.1429 10.7008 19.2737 39.0199 105.1805 20.0162 93.9027 9.2698 5.8355 82.4581 227.6192 54.7103 29.0543 84.9365 72.7907 8.3967 12.8267 4.0018 31.3805 8.5324 20.5057 3.8280 3.2052 8.3974 4.1904 8.9063 1.9100 3.2011 0.4276 1.7220
temp: 298.150 k
press: 1.00000 atm
elementType: 8 8 8 8 8 8 7 7 7 6 6 6 6 6 1 1 1 1 1 1 1 1 1
symmnumber: 1
zpe: 418983.3 jmol-1
zpe.correction: 0.159582 hartree
zpe.thermalcorrener: 0.174598 hartree
zpe.thermalcorrenthalpy: 0.175542 hartree
zpe.thermalcorrgfe: 0.117478 hartree
zpe.sumelectzpe: -810.159787 hartree
zpe.sumelectthermal: -810.144772 hartree
zpe.sumelectthermalent: -810.143827 hartree
zpe.sumelectthermalfe: -810.201891 hartree
dipole: 0.4821 -3.9784 1.3834
dipole: 4.2395
quadrupole: -97.2001 -85.9236 -78.5256
quadrupole: -5.5362 -4.7460 1.8766
quadrupole: -9.9836 1.2928 8.6908 -5.5362 -4.7460 1.8766
hfenergy: -810.3193695 hartree
pointgroup: C01 [X(C5H9N3O6)]
dipole: -0.2100397 1.6149289 0.3605189 debye
dipolederiv: -0.4775737 0.0014457 0.2666003 -0.1309611 -0.3554918 -0.0999027 0.1700679 -0.2236941 -0.5948007 -0.4216332 -0.2018719 -0.0454576 -0.1794762 -0.460655 -0.2983501 0.0834626 -0.1629605 -0.4695404 -0.2051843 -0.0702553 0.188279 -0.1061758 -0.5799905 0.221758 0.1533272 0.0471562 -0.5007256 -0.7460378 0.1108435 -0.1549022 0.0625104 -0.3851379 0.1808353 -0.083844 0.1662189 -0.2851372 -0.2405086 -0.03471 0.2071525 0.030989 -0.4491067 -0.134346 0.1784374 -0.0030052 -0.605081 -0.4708538 -0.0940266 0.0315179 0.0871725 -0.6077251 0.2949241 -0.0756301 0.3065546 -0.334848 0.7396323 0.260675 -0.2505728 0.4576562 0.553832 0.4541197 -0.3553692 0.4267566 0.773253 0.1487517 0.1688762 -0.4199846 0.0837787 1.0874193 -0.0944054 -0.3877317 0.0181484 0.8680921 1.1429274 0.0944264 0.1055078 0.0265617 0.8293771 -0.5447316 0.0718708 -0.5727112 0.3647309 0.0932483 -0.1901485 0.0674979 -0.1227217 0.1662903 -0.0649868 0.0594342 -0.1370825 0.1790355 0.2724743 -0.1212756 0.0985644 -0.1532817 -0.1130846 0.0914478 0.1780362 0.1246089 0.278743 -0.0911369 0.0686073 0.0143309 -0.0137696 -0.0798127 -0.0327672 0.0128334 0.0179064 -0.0306712 -0.0768547 0.0134389 -0.0493396 -0.0255478 -0.0531416 -0.0086455 -0.0062137 0.009501 -0.1412146 -0.139317 -0.0319998 -0.0399366 0.0154389 -0.0403561 0.0419853 -0.0234322 0.0125645 -0.161774 -0.0136141 0.0873963 -0.0796678 0.0462923 0.0484974 0.014964 -0.0913453 0.0269883 0.0395156 0.0360635 -0.1067674 0.0245972 -0.0893929 0.0906679 -0.0042589 0.0132295 0.0212613 0.1039287 0.1227249 0.0169496 0.0230289 -0.0097865 0.0961541 0.0133699 0.0156903 -0.0266841 -0.0630752 -0.0449322 0.0901694 -0.0788581 0.0798721 0.064153 0.0275894 -0.0327915 0.0170896 0.0610812 0.1258137 0.002918 0.01915 0.0197454 -0.0140939 -0.0586587 0.0179105 -0.0315111 0.0992536 0.0460968 -0.0822227 0.0655547 -0.0629962 0.0693905 0.0273574 0.0601848 -0.0015076 0.1180296 0.0530272 -0.0335252 0.039236 -0.0552744 0.1103794 -0.0079215 0.04893 0.002027 0.1235168 0.1242046 -0.0095985 0.0128743 -0.0180693 -0.0558271 -0.0545862 0.0109388 -0.0395043 0.0895077 0.0226816 0.060655 -0.0451727 0.0574358 0.078262 0.0352099 -0.0179957 0.0018791 0.0881803 unknown
polarizability: 98.7493123|1.1643256|100.7329081|-4.3837737|-3.4127944|99.0953627 unknown
InChI: InChI=1S/C5H9N3O6/c1-4(2,6(9)10)5(3,7(11)12)8(13)14/h1-3H3
charge 0 multiplicity 1
23 atoms
O  -2.628065 0.21953 1.155951
O  -2.384931 -1.066284 -0.702493
O  0.082122 -2.367251 0.718181
O  2.877429 -0.03018 0.448025
O  1.068811 -1.702137 -1.228498
O  1.937203 1.672643 -0.730426
N  -2.028191 -0.11085 0.071012
N  0.549506 -1.486476 -0.078525
N  1.875408 0.610666 -0.021945
C  -0.731815 0.743241 -0.361029
C  0.458873 0.026156 0.397599
C  -0.952816 2.178174 0.15929
C  -0.664919 0.696315 -1.898796
C  0.410247 0.067783 1.926038
H  -1.811981 2.621282 -0.371573
H  -0.061315 2.786678 -0.058347
H  -1.173488 2.204784 1.235848
H  -1.602312 1.11241 -2.304275
H  -0.543022 -0.322014 -2.291654
H  0.173398 1.31934 -2.245094
H  -0.548999 -0.324121 2.293797
H  0.526968 1.106122 2.27692
H  1.229988 -0.539509 2.338395
