program: Gaussian 09
title: 000138452
version: EM64L-G09RevD.01
frameworkgroup: C1[X(C9H9Cl3)]
method: RPBEPBE
basis: SDD
operation: Freq
keyword: #pfreq=noraman
keyword: PBEPBE/SDD
title: #p freq=noraman PBEPBE/SDD
converged: NO NO NO NO
title: Mulliken charges:
elementType: Cl Cl Cl C C C C C C C C C H H H H H H H H H
charge: -0.038954 -0.038862 -0.039141 0.635780 0.635942 0.636125 -0.556948 -0.557020 -0.558177 -0.782783 -0.782833 -0.782962 0.244730 0.244813 0.253712 0.244746 0.253709 0.244855 0.253706 0.244722 0.244841
chargesum: 0.00000
title: Mulliken charges with hydrogens summed into heavy atoms:
elementType: Cl Cl Cl C C C C C C C C C
charge: -0.038954 -0.038862 -0.039141 0.635780 0.635942 0.636125 -0.556948 -0.557020 -0.558177 -0.039528 -0.039523 -0.039694
polarizability: 1.59395400e+02 -1.29590390e-02 1.59343045e+02 6.47509874e-03 -2.69550398e-03 6.14859270e+01
1716.lowfreq: -62.5333 -43.2007 -41.7123 -0.0019 -0.0018 0.0025 5.9550 10.9190 13.5513
frequency: -62.4998 -42.7138 -40.7280 85.1203 85.5132 111.5881 180.2877 217.2417 217.4702 328.3116 330.3127 331.5887 338.7804 339.7622 340.4989 381.2021 381.3438 567.5821 589.3967 589.7957 590.2567 667.2164 667.6615 743.9562 967.5407 967.9854 1028.5635 1029.2710 1039.5773 1040.6819 1041.7360 1047.2408 1061.4787 1323.3457 1335.2993 1363.0376 1363.6214 1403.5481 1403.9065 1406.0054 1463.4363 1463.8481 1469.3635 1470.8655 1472.0228 1472.6532 1564.8749 1565.1170 2991.2461 2991.4142 2991.7347 3080.7013 3080.8417 3081.1155 3121.6469 3122.1095 3122.3049
redmass: 1.0848 1.0753 1.0751 4.3164 4.3065 7.5438 3.4298 19.9680 20.0927 3.3447 3.3802 3.3682 5.4217 5.4382 30.2668 4.1733 4.1640 4.2963 3.5870 5.2143 5.2788 6.6927 6.6839 4.5883 3.2570 3.2754 1.7862 1.7801 1.5497 1.5021 1.5018 1.5506 9.9328 8.8473 7.1607 5.7864 5.7525 1.1944 1.1943 1.1859 1.0843 1.0873 1.0614 1.0645 1.1165 1.1186 6.8510 6.9280 1.0424 1.0424 1.0425 1.0905 1.0905 1.0904 1.1003 1.1003 1.1003
irintensity: 0.0022 1.1893 1.1822 0.0130 0.0069 1.8730 6.0971 0.0281 0.0265 0.1335 6.1468 6.0092 0.1093 0.0970 0.0059 2.1637 2.1475 0.1174 0.0219 0.5307 0.5308 39.6778 39.5056 0.7893 53.6551 53.4513 17.5166 17.3920 13.7828 2.4836 3.2436 0.0345 0.0093 0.5958 0.0028 61.5586 61.2645 15.4550 15.2873 1.1694 0.8491 0.4099 47.2180 3.0133 35.8966 37.1096 18.6630 18.5670 16.4954 17.0509 3.8847 3.8470 6.6268 25.2894 1.1197 4.1533 4.9372
temp: 298.150 k
press: 1.00000 atm
elementType: 17 17 17 6 6 6 6 6 6 6 6 6 1 1 1 1 1 1 1 1 1
symmnumber: 1
zpe: 397357.7 jmol-1
zpe.correction: 0.151346 hartree
zpe.thermalcorrener: 0.162432 hartree
zpe.thermalcorrenthalpy: 0.163376 hartree
zpe.thermalcorrgfe: 0.113566 hartree
zpe.sumelectzpe: -1727.662937 hartree
zpe.sumelectthermal: -1727.651850 hartree
zpe.sumelectthermalent: -1727.650906 hartree
zpe.sumelectthermalfe: -1727.700717 hartree
dipole: -0.0010 -0.0024 0.1260
dipole: 0.1260
quadrupole: -90.6136 -90.6239 -92.8334
quadrupole: -0.0040 0.0141 -0.0041
quadrupole: 0.7433 0.7331 -1.4764 -0.0040 0.0141 -0.0041
hfenergy: -1727.8142821 hartree
pointgroup: C01 [X(C9H9Cl3)]
dipole: -0.0005857 0.000837 -0.0495561 debye
dipolederiv: -0.2783992 -0.2698751 0.0025825 -0.2697493 -0.6613733 0.004905 0.0062151 0.0118744 -0.0577753 -0.7991734 -0.0310926 -0.0074805 -0.0312726 -0.1403437 -0.0004438 -0.0157014 -0.0006529 -0.057855 -0.3322692 0.3008439 0.003527 0.3009297 -0.6079098 -0.0054153 0.0079721 -0.0119898 -0.0577695 -0.2513012 -0.2646072 -0.0029208 -0.2644183 -0.0087846 0.0029962 0.0212154 -0.0341141 0.069712 0.159374 0.0281123 0.0035829 0.0276454 -0.4197464 -0.0001909 -0.0413123 -0.0022533 0.0697582 -0.2978878 0.2374004 -0.0025479 0.2376315 0.0379608 -0.0038836 0.0176603 0.0349967 0.0697339 0.2678547 0.4112887 -0.0177986 0.411349 0.8519209 -0.0349624 -0.0167734 -0.0326993 -0.1364693 1.061832 0.0476013 0.0430219 0.0474251 0.0575003 0.0021452 0.0411552 0.002003 -0.1364613 0.3499549 -0.4586958 -0.0219165 -0.4587434 0.7699797 0.0346223 -0.0207853 0.0327521 -0.1361089 -0.0432301 0.0859543 -0.0034334 0.0863325 -0.1226707 0.0053266 -0.0361861 0.0559127 0.0487481 -0.1772245 -0.0091573 0.0066539 -0.010245 0.011393 0.0003206 0.0671157 0.0028963 0.048703 -0.0289019 -0.0788273 -0.0028317 -0.0772896 -0.1365687 -0.0056317 -0.0303787 -0.0589347 0.0487815 -0.0363364 0.0271343 0.0817313 -0.0431625 0.0981766 0.0400378 0.0753543 -0.0024369 0.0749188 0.0689806 -0.0906464 -0.0706913 -0.0208247 -0.0067531 -0.0579933 -0.0291634 -0.0700934 0.074195 0.0860911 0.0546146 -0.0198732 0.0547128 0.0358317 0.0319335 -0.041823 0.0659235 -0.0735722 0.0607255 0.0259475 -0.0148638 0.0966101 0.0010608 0.0893028 -0.0454777 0.0597943 0.0753948 0.0011916 -0.0058939 0.0372173 -0.0060391 0.1208685 0.0028148 0.0777249 0.0045093 -0.0737998 0.0711382 -0.019214 -0.0064258 -0.0888359 -0.0087453 -0.0913608 -0.0403104 -0.0645612 0.0739788 0.0954268 -0.0494013 -0.0186561 -0.0492078 0.0263406 -0.032807 -0.0368127 -0.0688931 -0.0733559 0.0576642 0.0980675 -0.0749981 0.0273586 0.0041888 0.0506916 -0.0353867 0.0662961 0.0755154 -0.0355099 -0.0395539 0.086121 0.0297936 0.0976739 -0.0324078 0.0756977 0.0096704 0.0737277 unknown
polarizability: 159.3849485|0.0245792|159.3534573|0.0563583|0.0266065|61.4859661 unknown
InChI: InChI=1S/C9H9Cl3/c1-4-7(10)5(2)9(12)6(3)8(4)11/h1-3H3
charge 0 multiplicity 1
21 atoms
Cl 1.475408 2.85702 -0.025656
Cl -3.212016 -0.151582 -0.032869
Cl 1.737537 -2.706645 -0.028685
C  -0.783696 1.220862 0.017147
C  1.449348 0.068046 0.017462
C  -0.66527 -1.289288 0.017178
C  0.634643 1.229115 0.015338
C  -1.381846 -0.065192 0.013468
C  0.747674 -1.164669 0.014617
C  -1.601546 2.495269 0.01519
C  2.962005 0.140005 0.014037
C  -1.360865 -2.634394 0.016165
H  -2.571368 2.341253 0.512996
H  -1.059694 3.311803 0.517024
H  -1.810717 2.825686 -1.020597
H  3.399263 -0.740656 0.509239
H  3.350867 0.163518 -1.022308
H  3.314464 1.053544 0.517453
H  -1.546883 -2.9793 -1.019293
H  -0.741813 -3.398521 0.511047
H  -2.336996 -2.573273 0.521846
