program: Gaussian 09
title: 000138451
version: EM64L-G09RevD.01
frameworkgroup: C1[X(C5H7NS2)]
method: RPBEPBE
basis: SDD
operation: Freq
keyword: #pfreq=noraman
keyword: PBEPBE/SDD
title: #p freq=noraman PBEPBE/SDD
converged: NO YES NO NO
title: Mulliken charges:
elementType: S S N C C C C C H H H H H H H
charge: 0.324591 0.034651 -0.104593 0.632748 -0.594889 -0.546314 -0.723951 -0.763062 0.235946 0.268869 0.235972 0.281093 0.236940 0.236939 0.245058
chargesum: 0.00000
title: Mulliken charges with hydrogens summed into heavy atoms:
elementType: S S N C C C C C
charge: 0.324591 0.034651 -0.104593 0.632748 0.145899 -0.546314 -0.442857 -0.044125
polarizability: 1.28995102e+02 9.43016004e+00 1.01265398e+02 4.62145920e-04 2.65436694e-05 4.43602872e+01
1716.lowfreq: -11.3913 -7.9285 -0.0032 0.0025 0.0029 5.2402 49.7947 100.7879 192.5314
frequency: 48.1889 100.7851 192.5190 234.3993 245.7770 247.4853 312.8697 364.9972 452.1557 499.9572 528.2672 578.7050 602.2593 715.2068 775.8479 820.0563 917.0234 1007.8976 1047.4104 1105.6604 1117.8317 1147.0987 1187.6642 1304.8596 1342.0669 1407.6236 1434.2456 1460.6017 1464.2075 1478.1211 1486.7366 1611.2005 2979.9880 2986.6583 3056.7809 3085.1234 3096.2178 3105.0458 3246.6343
redmass: 1.0574 3.6329 1.3253 3.5581 6.1233 2.3611 2.8091 6.0922 7.2837 5.6087 7.4314 4.3704 5.2085 1.2315 5.3641 3.8984 5.7909 1.3876 1.4690 1.8820 1.3119 1.7430 3.6709 4.5245 4.2321 1.2746 1.1890 1.0937 1.0440 1.0756 1.0433 6.4023 1.0379 1.0330 1.0983 1.1029 1.1010 1.0974 1.0973
irintensity: 0.0694 0.5215 1.5508 6.9714 0.6846 0.3473 2.4886 2.2133 13.5213 0.0246 0.6594 8.0102 0.4894 58.7733 7.3512 5.6844 43.0007 8.1668 7.0370 135.4146 0.2352 8.3929 46.8969 105.6858 89.9135 11.8002 41.6679 45.8444 5.5719 7.6708 33.9922 9.4883 11.8650 64.5982 13.9979 24.2766 2.2220 13.1532 3.9675
temp: 298.150 k
press: 1.00000 atm
elementType: 16 16 7 6 6 6 6 6 1 1 1 1 1 1 1
symmnumber: 1
zpe: 291865.9 jmol-1
zpe.correction: 0.111166 hartree
zpe.thermalcorrener: 0.119932 hartree
zpe.thermalcorrenthalpy: 0.120876 hartree
zpe.thermalcorrgfe: 0.076742 hartree
zpe.sumelectzpe: -1044.997503 hartree
zpe.sumelectthermal: -1044.988737 hartree
zpe.sumelectthermalent: -1044.987793 hartree
zpe.sumelectthermalfe: -1045.031927 hartree
dipole: 5.8915 -1.3889 0.0006
dipole: 6.0530
quadrupole: -64.2132 -56.9958 -64.7823
quadrupole: -1.1978 -0.0004 0.0001
quadrupole: -2.2161 5.0013 -2.7852 -1.1978 -0.0004 0.0001
hfenergy: -1045.1086691 hartree
pointgroup: C01 [X(C5H7N1S2)]
dipole: 2.3406931 -0.4386225 0.0002385 debye
dipolederiv: -0.0867579 -0.011879 -0.0000112 -0.4220029 -0.4310276 -0.0000433 -0.0000677 -0.0001116 0.1594654 -0.9291525 -0.3016204 -0.0000353 -0.353933 -0.4528158 -0.0000103 0.0001687 0.000076 -0.192848 -1.0514213 -0.2142164 -0.0000081 0.3153876 -0.6189847 0.0000225 -0.0000378 -0.0000626 -0.0676045 0.3509215 0.2632319 0.0000018 0.0797142 0.3128447 -0.0000191 0.0000152 0.0000612 0.045549 -0.0324342 0.0374981 -0.0000236 -0.178383 0.3847662 -0.0000703 -0.0001266 -0.0000403 0.2248194 1.5191363 0.5147372 0.0000786 0.4185734 0.7882695 0.0000631 -0.0000334 -0.0000132 -0.2195718 0.0426305 -0.247656 -0.0000155 -0.042943 -0.275893 0.0000172 0.0000343 0.0000262 -0.3701134 -0.053561 0.0104424 -0.0000073 0.073651 0.0158082 0.000015 -0.0000028 -0.000015 0.0968438 0.0564369 0.0930698 0.1050617 0.0591194 0.0129013 -0.0100332 0.0991158 -0.0633871 -0.0496495 0.0584899 -0.1924613 -0.0000962 -0.0039533 0.1437851 0.0000208 -0.0000271 -0.0000033 0.1284457 0.0566173 0.0929369 -0.1049405 0.0591275 0.012833 0.0100603 -0.0990308 0.0634898 -0.0498372 -0.0142128 -0.066036 -0.0000095 -0.0145171 0.0940392 -0.0000086 -0.0000185 -0.0000113 0.2347951 0.0425153 0.0385385 -0.01779 0.083171 0.0166379 -0.106594 0.0420254 -0.1115152 -0.0330602 0.0425337 0.0385048 0.0178134 0.0831511 0.0166127 0.106607 -0.0419945 0.111524 -0.0330285 -0.0017418 -0.0550905 -0.0000182 -0.156163 -0.0197765 -0.0000271 -0.0000202 -0.0000175 0.1257947 unknown
polarizability: 128.0643574|10.6710312|102.1961428|0.0004604|0.0000479|44.3602872 unknown
InChI: InChI=1S/C5H7NS2/c1-4-3-8-5(7)6(4)2/h3H,1-2H3
charge 0 multiplicity 1
15 atoms
S  -0.858879 1.859051 0.000069
S  -2.747352 -0.630322 -0.000028
N  0.040557 -0.604487 -0.000029
C  1.204546 0.210029 0.00006
C  0.112309 -2.077038 0.000082
C  -1.195482 0.055533 -0.000208
C  0.91905 1.551274 0.000059
C  2.573455 -0.414068 0.000145
H  0.636167 -2.440578 -0.901111
H  -0.9222 -2.458356 -0.000408
H  0.63525 -2.440513 0.90184
H  1.627715 2.37519 0.000133
H  2.736672 -1.046874 -0.892331
H  2.736495 -1.04704 0.892534
H  3.341295 0.375999 0.000293
