program: Gaussian 09
title: 000138448
version: EM64L-G09RevD.01
frameworkgroup: C1[X(C8H6BrNS)]
method: RPBEPBE
basis: SDD
operation: Freq
keyword: #p
keyword: freq=noraman
keyword: PBEPBE/SDD
title: #p freq=noraman PBEPBE/SDD
converged: NO YES NO NO
title: Mulliken charges:
elementType: Br S N C C C C C C C C H H H H H H
charge: 0.017692 0.218724 -0.015784 -0.346009 0.353739 -0.090429 -0.226395 -0.327971 -0.227817 -0.167810 -0.728704 0.267651 0.265295 0.255237 0.245368 0.245397 0.261817
chargesum: 0.00000
title: Mulliken charges with hydrogens summed into heavy atoms:
elementType: Br S N C C C C C C C C
charge: 0.017692 0.218724 -0.015784 -0.346009 0.353739 -0.090429 0.041256 -0.062676 -0.227817 0.087427 0.023878
polarizability: 2.13340111e+02 4.31789586e+00 1.18319337e+02 -2.43026995e-02 2.10219135e-03 4.88352291e+01
1716.lowfreq: -8.4691 -0.0021 -0.0018 -0.0013 2.7313 4.1210 70.2810 76.7196 147.1250
frequency: 70.2715 76.6384 147.1250 179.9452 191.1730 240.3393 280.8364 341.4516 391.0205 429.6011 493.7894 508.0356 519.5522 552.1258 587.1566 654.2843 708.4051 734.2436 826.1241 838.0778 870.1591 961.1550 984.0712 1032.9323 1035.3636 1055.4562 1123.4742 1139.6674 1228.9221 1263.6354 1360.1428 1391.2752 1393.1038 1430.6935 1454.1606 1454.9868 1549.4322 1558.6814 1604.5616 2992.0454 3073.0501 3118.1361 3163.7221 3177.6478 3183.1979
redmass: 3.6835 1.1484 7.7017 4.5799 5.5387 8.4271 4.3189 5.3024 6.8965 3.0119 6.9567 6.3958 6.3467 5.5065 4.0922 7.0467 9.1358 4.1612 1.4897 6.1775 1.3891 1.3525 2.3189 3.2454 1.4290 2.9246 1.5785 2.3052 2.1823 1.7172 3.9492 3.1601 1.4142 3.2148 1.0442 1.0875 7.4203 7.3936 8.0551 1.0369 1.0977 1.0991 1.0887 1.0934 1.0977
irintensity: 0.8335 0.2510 0.3837 3.9985 0.3965 1.5084 4.7164 3.0089 0.0476 9.7806 6.7028 1.3727 0.0694 49.1071 9.2635 10.4346 30.9350 0.0125 47.9519 12.6959 18.2105 0.9405 13.1948 0.3742 2.6124 21.5883 31.3963 57.9483 3.0348 5.0354 8.7577 14.9149 34.2296 61.9502 21.2720 23.3221 27.3490 28.6107 62.7332 13.5603 10.3610 5.2319 0.5151 0.2823 3.7489
temp: 298.150 k
press: 1.00000 atm
elementType: 35 16 7 6 6 6 6 6 6 6 6 1 1 1 1 1 1
symmnumber: 1
zpe: 307260.1 jmol-1
zpe.correction: 0.117029 hartree
zpe.thermalcorrener: 0.127022 hartree
zpe.thermalcorrenthalpy: 0.127966 hartree
zpe.thermalcorrgfe: 0.080010 hartree
zpe.sumelectzpe: -773.959552 hartree
zpe.sumelectthermal: -773.949559 hartree
zpe.sumelectthermalent: -773.948615 hartree
zpe.sumelectthermalfe: -773.996570 hartree
dipole: -2.0754 -0.2415 0.0004
dipole: 2.0894
quadrupole: -70.9071 -77.2300 -83.6924
quadrupole: 4.1538 -0.0021 -0.0003
quadrupole: 6.3694 0.0465 -6.4159 4.1538 -0.0021 -0.0003
hfenergy: -774.0765808 hartree
pointgroup: C01 [X(C8H6Br1N1S1)]
dipole: -0.8194394 0.0654115 -0.0001754 debye
dipolederiv: -0.7567156 -0.1342928 -0.0001107 -0.2119549 -0.1057109 -0.0000347 -0.0001109 -0.0000229 -0.0318449 -0.4793057 -0.1267889 -0.0000574 -0.1053814 -0.4452789 -0.0000399 -0.000074 -0.0000066 0.067351 -0.5444412 0.2345087 -0.0000355 0.1054828 -0.7823686 0.0000072 -0.0000278 -0.0000285 -0.1812149 0.4058464 -0.237438 0.0000686 -0.3315667 0.0149184 -0.0000311 0.0000448 -0.0000332 -0.0876251 0.2316907 -0.0969254 0.0000085 0.1470863 -0.0173947 0.0000142 -0.000024 0.0000148 0.0710484 0.6559176 0.143334 0.0001238 0.2703036 1.0544841 0.0000527 0.000388 0.0000083 -0.0729161 -0.4917084 0.0790314 -0.0000574 0.0357479 -0.0126922 0.0000047 -0.0000577 0.0000018 -0.0632089 0.1530377 0.0666819 0.0000448 -0.0541325 0.0823093 0.0000033 0.0000518 0.0000143 -0.1298863 1.2610084 0.274906 0.0002107 0.3626742 0.2255534 0.0000743 0.0002154 0.0000626 -0.1357429 -0.3990703 -0.2221376 -0.0000553 -0.1895856 -0.0834686 -0.0000244 -0.0000555 -0.000027 -0.1125106 -0.2677057 0.0067354 -0.0000575 -0.0001395 -0.0323273 0.0000199 -0.0004731 0.0000509 0.0668399 0.088131 -0.0055209 -0.0000122 -0.0394516 0.0023277 -0.0000134 -0.0000118 -0.0000058 0.1684705 0.0552741 -0.0533749 -0.0000186 -0.0151782 -0.0270454 -0.0000138 -0.0000157 -0.0000137 0.1707306 0.0094416 0.0825796 -0.0000162 0.0724311 0.0409702 0.0000017 -0.0000171 0.0000007 0.1664302 0.0211448 0.0073702 0.0252801 0.0279277 0.0656749 -0.0981996 0.0836432 -0.0789773 -0.0156383 0.0209856 0.0073447 -0.0253239 0.0277689 0.0659724 0.0980262 -0.0835857 0.0788367 -0.0159559 0.0364692 -0.0260133 0.0000082 -0.1020322 -0.045924 0.0001525 0.0001102 0.0001248 0.1356733 unknown
polarizability: 213.5279377|-0.8726525|118.13151|0.0242108|0.0029797|48.8352291 unknown
InChI: InChI=1S/C8H6BrNS/c1-5-10-7-3-2-6(9)4-8(7)11-5/h2-4H,1H3
charge 0 multiplicity 1
17 atoms
Br 4.169478 0.729157 0.000481
S  -1.555904 1.710707 -0.000293
N  -1.759175 -0.982211 -0.000416
C  -0.049472 0.707588 -0.000109
C  -0.379856 -0.687862 -0.000234
C  -2.509563 0.094625 -0.000416
C  1.287193 1.152285 0.000109
C  0.654832 -1.650963 -0.000146
C  2.289772 0.161138 0.000189
C  1.997486 -1.225638 0.000065
C  -4.006648 0.129821 -0.000662
H  1.546362 2.213455 0.000194
H  0.398887 -2.714016 -0.000239
H  2.81005 -1.956667 0.000125
H  -4.396112 0.655441 0.889986
H  -4.395797 0.653917 -0.892354
H  -4.388632 -0.903077 0.000119
