program: Gaussian 09
title: 000138443
version: EM64L-G09RevD.01
frameworkgroup: C1[X(C12H11Cl)]
method: RPBEPBE
basis: SDD
operation: Freq
keyword: #p
keyword: freq=noraman
keyword: PBEPBE/SDD
title: #p freq=noraman PBEPBE/SDD
converged: NO NO NO NO
title: Mulliken charges:
elementType: Cl C C C C C C C C C C C C H H H H H H H H H H H
charge: -0.092698 0.241047 0.225782 0.442363 0.331525 -0.437814 -0.461267 -0.381627 -0.386524 -0.822502 -0.835220 -0.257611 -0.254449 0.234047 0.234793 0.258493 0.244880 0.279456 0.271311 0.238400 0.233577 0.235610 0.229858 0.228572
chargesum: 0.00000
title: Mulliken charges with hydrogens summed into heavy atoms:
elementType: Cl C C C C C C C C C C C C
charge: -0.092698 0.241047 0.225782 0.442363 0.331525 -0.203767 -0.226474 -0.123134 -0.141644 -0.271736 -0.127633 -0.027753 -0.025877
polarizability: 1.77711468e+02 -2.76471405e-01 1.74383769e+02 6.51788296e+00 -3.08723250e+00 7.32088864e+01
1716.lowfreq: -11.0198 -5.9376 0.0008 0.0013 0.0023 7.3006 60.7447 73.2607 133.2088
frequency: 60.7417 73.2573 133.2073 159.4801 192.0868 200.9151 275.2978 298.3192 343.8491 413.3470 464.1597 470.9590 485.4411 487.5654 530.4074 557.5055 618.1836 666.4402 688.3339 741.3925 772.8758 789.0207 793.9486 841.7448 878.4681 899.3147 953.5977 962.0255 969.9871 993.0926 1027.9689 1045.4635 1049.0605 1067.1883 1128.7872 1163.2650 1170.3908 1183.2220 1245.4894 1253.8708 1259.0086 1286.0963 1370.5673 1389.5190 1398.6328 1415.8485 1439.9900 1460.7365 1467.8584 1471.0070 1481.1368 1522.5551 1595.0651 1598.2910 1628.1856 2973.4270 3048.1466 3065.0609 3088.4055 3119.9620 3128.2452 3140.8403 3142.8457 3144.7123 3155.9516 3167.3573
redmass: 6.2090 6.7126 3.2698 3.3128 1.3106 3.1470 3.2652 2.6007 4.1788 3.1123 4.7818 3.5007 4.4913 3.6743 5.3797 4.8195 3.1208 3.4915 5.2751 4.6980 1.4797 5.2981 2.5528 1.2906 1.6830 1.6923 1.4179 1.3766 1.8027 1.3308 2.8179 1.5787 3.4110 1.8529 1.1845 1.5534 1.6174 1.1094 1.1750 2.5165 1.5496 1.7566 3.5532 1.9294 1.3929 5.1368 2.5259 2.7275 1.1606 1.0463 1.1266 3.8638 6.7108 5.7389 6.3663 1.0379 1.0971 1.0577 1.0981 1.0878 1.0851 1.0926 1.0959 1.1064 1.0949 1.1003
irintensity: 0.9028 1.8959 0.2483 1.5197 3.2074 3.2425 0.2045 2.6113 4.3517 4.7671 4.1230 0.9321 2.4637 15.4272 2.6007 53.6520 10.1827 10.7348 4.2491 17.5641 76.6044 2.1531 15.5909 31.7611 0.3303 4.6153 0.7288 1.4149 4.2811 0.0368 8.1030 6.2216 2.8338 0.1143 9.1597 8.2012 6.7797 0.7197 25.7601 11.4615 19.0271 2.5672 1.3672 1.5424 20.1231 0.3892 7.6077 1.4677 13.1274 15.3292 10.4070 15.1620 6.0382 19.1188 0.3973 30.8083 17.9347 22.5709 19.8341 13.0736 0.7079 2.5965 26.8149 11.3600 25.6119 23.5471
temp: 298.150 k
press: 1.00000 atm
elementType: 17 6 6 6 6 6 6 6 6 6 6 6 6 1 1 1 1 1 1 1 1 1 1 1
symmnumber: 1
zpe: 502486.1 jmol-1
zpe.correction: 0.191387 hartree
zpe.thermalcorrener: 0.202558 hartree
zpe.thermalcorrenthalpy: 0.203502 hartree
zpe.thermalcorrgfe: 0.153885 hartree
zpe.sumelectzpe: -923.041710 hartree
zpe.sumelectthermal: -923.030539 hartree
zpe.sumelectthermalent: -923.029595 hartree
zpe.sumelectthermalfe: -923.079212 hartree
dipole: -2.6389 -0.6118 1.4762
dipole: 3.0850
quadrupole: -81.7787 -72.5465 -87.1564
quadrupole: -0.5237 7.5341 -0.4795
quadrupole: -1.2848 7.9474 -6.6625 -0.5237 7.5341 -0.4795
hfenergy: -923.233097 hartree
pointgroup: C01 [X(C12H11Cl1)]
dipole: 0.9079467 0.4908179 0.638657 debye
dipolederiv: -0.6354718 -0.1697579 -0.1161633 -0.3142207 -0.3020067 -0.1017755 -0.5069272 -0.2144715 -0.4049677 -0.0180221 -0.0589604 0.0154889 -0.1983392 0.0355605 -0.0012171 0.0117435 0.0243204 0.0273334 -0.1128954 -0.134203 0.0182426 -0.1805484 -0.0614924 0.0062985 0.0266722 0.0167957 0.0077605 -0.2321452 -0.1063434 -0.0025108 -0.1843484 -0.1134694 -0.0332682 0.1519762 0.0474529 -0.1412666 0.3480761 0.2201799 -0.0467104 0.0489398 0.1366724 -0.0198975 -0.0584865 -0.0351348 -0.0191746 0.1619089 -0.0165203 -0.0535269 0.1124432 0.0161597 0.0040762 -0.0793605 -0.0343893 -0.1256928 -0.3427333 -0.0422037 -0.0011102 0.1160047 0.0941578 -0.0097964 0.0394732 0.0056615 -0.165498 0.0175446 0.0784548 -0.0115228 0.0978303 -0.0311246 -0.0034087 0.0232319 -0.0093819 -0.1492167 0.0495025 0.0096088 -0.0271078 0.0701881 -0.0394775 -0.0073663 -0.0303188 -0.0030937 -0.1560198 0.8619281 0.2807068 0.1938601 0.4466113 0.322887 0.1790633 0.440626 0.2240727 0.5023117 -0.1483253 -0.1127643 0.027485 -0.0256626 0.0489727 0.0086894 0.0260092 0.0144368 0.0562952 -0.0319988 0.0767556 -0.0166427 0.0794003 0.1306988 -0.0068927 -0.0240061 0.0067158 -0.1530576 0.1072961 -0.0752213 -0.0354685 -0.0806416 -0.0758109 0.0108069 -0.0361966 0.0069445 -0.1551465 -0.0736376 0.103573 0.033192 0.0825602 0.0363192 -0.0027254 0.0241326 -0.0145071 0.1345732 0.0777935 -0.0408477 0.0089138 -0.028205 -0.1378952 0.0064192 0.0170481 0.012781 0.150693 -0.0362433 -0.0891346 0.031981 -0.0489101 0.0590964 0.0019054 0.0101114 0.0025498 0.1384329 -0.0665751 -0.0510517 0.0278003 -0.0977708 0.0619561 0.0133696 0.0298506 0.0090137 0.1393573 -0.0161665 0.0138102 -0.0059205 0.1065383 -0.0153185 -0.1027295 -0.0241811 -0.0639644 0.0128653 0.0383724 -0.0117711 -0.065907 -0.1114066 -0.0354107 0.0705454 -0.0808585 0.0222418 -0.0483876 0.0869373 0.0853678 0.0014608 -0.0395619 -0.1582694 0.0094119 0.0038258 -0.0055662 0.1082356 -0.0568088 -0.0252351 -0.0840186 0.0312802 0.076286 0.0669727 -0.1149816 0.0244977 -0.0134165 0.0007864 -0.0276425 0.0742083 0.0164382 0.0724113 -0.0820389 0.1103637 -0.0221091 -0.0588286 0.085932 -0.0154949 0.0078403 -0.0031153 -0.1341595 0.0049256 0.0117631 -0.0007146 0.1568734 -0.0650545 0.1086948 0.0261365 0.1044957 0.0132566 -0.0113679 0.0284895 -0.0141516 0.1559414 unknown
polarizability: 178.0199731|0.694062|174.2410287|-2.7088796|5.1382067|73.043122 unknown
InChI: InChI=1S/C12H11Cl/c1-9-6-7-10(8-13)12-5-3-2-4-11(9)12/h2-7H,8H2,1H3
charge 0 multiplicity 1
24 atoms
Cl -3.588443 -0.994089 -0.97915
C  -0.262404 -0.456694 0.17356
C  1.027541 0.181173 -0.018534
C  -1.443576 0.364681 0.338913
C  1.122698 1.626059 -0.064029
C  -1.313938 1.757852 0.281466
C  -0.047045 2.380222 0.082326
C  -0.326182 -1.889787 0.187586
C  2.190173 -0.648229 -0.164731
C  -2.79087 -0.23009 0.604343
C  2.458091 2.316054 -0.269992
C  0.824755 -2.667066 0.041192
C  2.097057 -2.04091 -0.132361
H  -2.205596 2.386254 0.39486
H  0.009553 3.474279 0.046529
H  -1.298317 -2.382082 0.28862
H  3.167136 -0.174783 -0.305727
H  -3.522367 0.525955 0.920103
H  -2.778766 -1.07388 1.309091
H  2.334759 3.411703 -0.279288
H  3.177072 2.063769 0.532758
H  2.926514 2.020654 -1.228226
H  0.753791 -3.760304 0.049235
H  2.995664 -2.657341 -0.245843
