program: Gaussian 09
title: 000138442
version: EM64L-G09RevD.01
frameworkgroup: C1[X(C4H3NOS)]
method: RPBEPBE
basis: SDD
operation: Freq
keyword: #p
keyword: freq=noraman
keyword: PBEPBE/SDD
title: #p freq=noraman PBEPBE/SDD
converged: NO YES NO YES
title: Mulliken charges:
elementType: S O N C C C C H H H
charge: 0.390550 -0.175990 -0.309412 -0.139159 -0.226274 -0.188267 -0.101403 0.293105 0.273951 0.182898
chargesum: 0.00000
title: Mulliken charges with hydrogens summed into heavy atoms:
elementType: S O N C C C C
charge: 0.390550 -0.175990 -0.309412 -0.139159 0.066831 0.085684 0.081496
polarizability: 9.43964837e+01 2.17115364e+00 7.51032093e+01 4.25013328e-03 4.77459284e-03 2.62534132e+01
1716.lowfreq: -9.6069 -5.8572 0.0018 0.0023 0.0026 9.2960 124.1964 183.7258 225.8950
frequency: 124.1906 183.7250 225.8917 384.4134 468.0939 558.6933 578.1162 599.2041 769.1755 816.3777 841.2663 921.2636 973.2590 1020.2874 1114.3092 1214.6677 1276.0354 1379.1121 1404.1129 1517.1760 1589.5643 2917.8895 3174.8997 3210.5602
redmass: 5.5111 6.8743 2.9016 12.8592 6.4654 13.5921 2.9210 10.2216 5.5819 6.6867 1.2037 1.4418 1.7472 1.8830 2.9809 1.5538 2.8079 1.8341 2.0951 6.3860 6.8965 1.0861 1.0921 1.0990
irintensity: 16.9927 11.0134 4.9159 1.3051 23.9822 12.6265 0.0113 13.8648 30.6931 7.6327 59.9069 0.3007 3.0128 15.0277 16.7171 25.6046 75.3879 16.5335 1.9276 50.7380 145.7351 81.4665 1.3020 1.3151
temp: 298.150 k
press: 1.00000 atm
elementType: 16 8 7 6 6 6 6 1 1 1
symmnumber: 1
zpe: 163064.7 jmol-1
zpe.correction: 0.062108 hartree
zpe.thermalcorrener: 0.068257 hartree
zpe.thermalcorrenthalpy: 0.069201 hartree
zpe.thermalcorrgfe: 0.031441 hartree
zpe.sumelectzpe: -681.713250 hartree
zpe.sumelectthermal: -681.707101 hartree
zpe.sumelectthermalent: -681.706157 hartree
zpe.sumelectthermalfe: -681.743918 hartree
dipole: 0.6136 0.2005 0.0003
dipole: 0.6455
quadrupole: -61.0666 -39.9815 -48.3425
quadrupole: 6.0732 -0.0007 0.0014
quadrupole: -11.2697 9.8154 1.4544 6.0732 -0.0007 0.0014
hfenergy: -681.7753582 hartree
pointgroup: C01 [X(C4H3N1O1S1)]
dipole: -0.2480071 -0.0546147 0.0001133 debye
dipolederiv: 0.0171543 -0.1726797 0.000025 -0.1322256 -0.2264231 0.0000481 0.000001 0.0000577 0.2105705 -1.0187385 0.0746643 -0.0000035 0.3474159 -0.4491028 0.0000279 0.0001092 -0.0000378 -0.3224856 -0.2121869 0.2929028 -0.0000335 0.0025057 0.1737248 -0.0000423 0.0000048 -0.0000702 -0.3152606 -0.6304572 -0.2870292 0.0000782 -0.5446556 0.2160464 -0.0000047 0.0000326 -0.0000131 -0.1448104 -0.025294 -0.2175067 0.0000191 0.1110426 -0.179356 0.0000032 -0.0000271 0.0000089 -0.0810726 0.0938073 0.2546419 -0.0000236 0.2077279 -0.0741223 -0.000008 -0.0000265 -0.0000036 -0.0433768 1.5599618 0.0393929 -0.0000797 0.1485091 0.6861245 -0.0001173 -0.0001507 -0.00007 0.1833046 0.1064837 0.0447462 -0.0000013 0.0458483 0.054358 0.0000149 -0.0000021 0.000014 0.2060257 0.0761901 -0.0419552 0.0000114 -0.0733589 0.0149704 0.0000202 0.0000126 0.0000204 0.1915249 0.0330794 0.0128228 0.0000079 -0.1128093 -0.21622 0.0000581 0.0000461 0.0000937 0.1155803 unknown
polarizability: 94.635105|0.2306146|74.8645881|-0.0047014|-0.004331|26.2534132 unknown
InChI: InChI=1S/C4H3NOS/c6-3-4-1-2-5-7-4/h1-3H
charge 0 multiplicity 1
10 atoms
S  -0.884118 1.490036 -0.000232
O  2.699203 -0.417484 -0.00039
N  -2.231334 0.290512 -0.000044
C  0.372653 0.189923 -0.000126
C  -0.249774 -1.059708 0.00001
C  -1.67972 -0.946809 0.000048
C  1.816683 0.482778 -0.000187
H  0.307394 -1.997588 0.000086
H  -2.376686 -1.789584 0.000164
H  2.093898 1.563523 -0.000528
