program: Gaussian 09
title: 000138441
version: EM64L-G09RevD.01
frameworkgroup: C1[X(C9H10)]
method: RPBEPBE
basis: SDD
operation: Freq
keyword: #p
keyword: freq=noraman
keyword: PBEPBE/SDD
title: #p freq=noraman PBEPBE/SDD
converged: YES YES NO NO
title: Mulliken charges:
elementType: C C C C C C C C C H H H H H H H H H H
charge: -0.530529 -0.224185 -0.224183 -0.215768 -0.215769 -0.170653 -0.170656 -0.216189 -0.216182 0.236933 0.220865 0.225407 0.225406 0.231752 0.231752 0.211001 0.211001 0.195000 0.194998
chargesum: 0.00000
title: Mulliken charges with hydrogens summed into heavy atoms:
elementType: C C C C C C C C C
charge: -0.072732 0.001221 0.001223 0.015984 0.015983 0.040348 0.040345 -0.021189 -0.021184
polarizability: 9.15734172e+01 -1.76414984e-04 1.04078300e+02 1.91511635e-01 3.65813656e-05 6.43758487e+01
1716.lowfreq: -16.7026 -12.1432 -0.0007 -0.0006 -0.0005 9.2830 199.0651 213.4170 317.4057
frequency: 199.0589 213.4162 317.4056 338.5074 397.5792 506.0163 527.3610 596.7913 685.3237 728.3136 752.5435 774.5716 792.5070 817.6812 836.8305 876.4956 901.2278 916.7154 956.9544 965.7538 967.4878 986.3976 1006.4140 1062.3259 1065.4347 1105.4954 1158.2905 1190.9752 1233.5125 1236.7316 1249.2131 1265.2084 1311.3701 1315.3454 1319.4047 1379.2012 1413.7098 1460.6182 1584.8613 1613.4157 1625.6007 3004.9566 3016.0356 3027.4273 3075.6901 3086.8909 3089.0175 3107.4575 3121.7779 3137.5380 3171.5994
redmass: 2.7047 3.4252 2.5397 4.2217 2.2518 3.4582 3.0090 3.3243 1.2698 1.7371 3.3530 3.0517 1.7224 3.2414 2.8883 3.7756 2.7141 1.4049 1.9983 1.5959 1.9624 1.3045 1.9414 1.6181 1.4500 1.2828 1.2860 1.3690 1.3328 1.1851 1.2923 1.3838 1.3722 1.6797 1.4841 1.3517 1.5761 1.1017 6.7774 7.8304 5.2248 1.0689 1.0850 1.0795 1.0818 1.0884 1.1006 1.0953 1.0973 1.0857 1.1066
irintensity: 0.2039 0.4971 0.8326 0.1615 7.3912 0.6642 1.3330 4.4952 105.6315 62.6606 0.0542 3.9316 0.9155 16.6597 9.1542 2.8347 7.7595 3.4183 0.8278 8.8727 9.2755 0.0637 14.3892 0.0034 0.1792 1.7208 0.1613 0.4348 0.9066 1.5564 3.3940 0.0020 2.4735 4.7271 1.1421 8.4525 0.5800 8.1676 0.7155 3.7475 0.0408 5.5780 48.3124 65.7954 0.0448 2.9750 27.9923 68.3081 47.3692 9.3324 25.7555
temp: 298.150 k
press: 1.00000 atm
elementType: 6 6 6 6 6 6 6 6 6 1 1 1 1 1 1 1 1 1 1
symmnumber: 1
zpe: 421626.6 jmol-1
zpe.correction: 0.160589 hartree
zpe.thermalcorrener: 0.167419 hartree
zpe.thermalcorrenthalpy: 0.168363 hartree
zpe.thermalcorrgfe: 0.129923 hartree
zpe.sumelectzpe: -348.241918 hartree
zpe.sumelectthermal: -348.235088 hartree
zpe.sumelectthermalent: -348.234144 hartree
zpe.sumelectthermalfe: -348.272584 hartree
dipole: -0.0776 0.0000 0.0433
dipole: 0.0889
quadrupole: -52.8918 -48.4373 -54.9413
quadrupole: -0.0001 -0.9059 0.0000
quadrupole: -0.8017 3.6528 -2.8512 -0.0001 -0.9059 0.0000
hfenergy: -348.4025073 hartree
pointgroup: C01 [X(C9H10)]
dipole: -0.0293559 0.0000007 0.0189971 debye
dipolederiv: 0.0217967 0.0000076 0.0029107 0.0000072 -0.0430361 -0.0000013 0.0324321 0.0000028 0.0548903 0.0511165 -0.164143 -0.0713222 -0.1271986 0.0798721 0.0490482 -0.0960563 0.1695618 0.0977099 0.0510366 0.1641431 -0.0713 0.1271998 0.0799698 -0.0490706 -0.0959964 -0.1695862 0.0976988 -0.2216644 0.1415341 0.1367049 0.1056016 0.0402219 -0.0053504 0.2012258 -0.1137483 0.0171804 -0.2216 -0.1416188 0.1366934 -0.1056934 0.0401393 0.0053916 0.2011806 0.1138082 0.0171861 0.143165 0.012452 -0.0875549 0.099836 -0.0037602 -0.0200176 -0.1135003 -0.1137882 -0.2356176 0.1431968 -0.0124146 -0.0875629 -0.0997878 -0.0038004 0.0199965 -0.113535 0.1137516 -0.2356132 -0.0078532 0.170827 -0.0723189 0.0830738 0.0694596 -0.0443135 -0.0862936 -0.0458175 -0.1503445 -0.0077654 -0.1708464 -0.072333 -0.0830947 0.0693861 0.0443023 -0.0863007 0.0458028 -0.1503433 -0.0183063 -0.0000055 -0.1456791 -0.0000074 0.0489994 -0.0000181 -0.0871706 -0.0000107 -0.0454598 -0.108464 -0.0000294 0.148157 -0.0000268 0.066875 0.0000216 0.1030585 0.0000168 0.0000966 0.0187498 0.0791731 0.0488539 0.0783402 -0.1169971 -0.0801326 0.0560982 -0.0947101 0.0245603 0.0187943 -0.0791369 0.0488257 -0.0783059 -0.1170549 0.0801399 0.0560654 0.0947189 0.0245698 0.1635644 0.0105154 -0.0763855 0.0491766 0.0234766 0.0856511 -0.1251644 0.0816751 -0.0351663 0.163584 -0.0104682 -0.0763591 -0.0491271 0.0234701 -0.0856699 -0.1251421 -0.0817088 -0.0351755 0.0229046 -0.0496765 0.0386156 -0.0681805 -0.1454318 0.0282802 0.0407556 0.019364 0.1460967 0.0228677 0.0497282 0.0386254 0.0682296 -0.1453938 -0.0282776 0.0407607 -0.0193575 0.1460968 -0.1175355 -0.0871271 0.0807105 -0.0636305 0.0167785 0.0215123 0.0987855 0.0473759 0.1308185 -0.1175877 0.087086 0.0807184 0.063588 0.016826 -0.0214919 0.0987971 -0.0473506 0.1308159 unknown
polarizability: 91.4834124|-0.0018825|104.0782999|-1.5736884|0.0007126|64.4658538 unknown
InChI: InChI=1S/C9H10/c1-2-4-9-6-5-8(3-1)7-9/h1-6,8-9H,7H2
charge 0 multiplicity 1
19 atoms
C  -0.754262 -0.000148 1.388988
C  -0.70667 1.228326 0.432657
C  -0.70631 -1.228555 0.432583
C  -1.418073 0.682286 -0.812062
C  -1.417872 -0.682656 -0.812103
C  0.710329 1.61053 0.010598
C  0.710804 -1.610324 0.010524
C  1.734169 0.734583 -0.26632
C  1.734382 -0.734061 -0.26635
H  0.063095 -0.000051 2.128614
H  -1.722739 -0.000301 1.922092
H  -1.214008 2.109029 0.866656
H  -1.213394 -2.10943 0.866531
H  -1.762007 1.321136 -1.632492
H  -1.761613 -1.321559 -1.632573
H  0.917166 2.684589 -0.102394
H  0.91797 -2.684318 -0.102498
H  2.692989 1.185543 -0.561858
H  2.693343 -1.184721 -0.561893
