program: Gaussian 09
title: 000138440
version: EM64L-G09RevD.01
frameworkgroup: C1[X(C5H8O2)]
method: RPBEPBE
basis: SDD
operation: Freq
keyword: #p
keyword: freq=noraman
keyword: PBEPBE/SDD
title: #p freq=noraman PBEPBE/SDD
converged: YES YES NO NO
title: Mulliken charges:
elementType: O O C C C C C H H H H H H H H
charge: -0.420201 -0.232237 -0.104408 -0.504389 -0.488798 -0.506896 0.195575 0.260437 0.220655 0.242130 0.243185 0.223249 0.241164 0.255534 0.375001
chargesum: 0.00000
title: Mulliken charges with hydrogens summed into heavy atoms:
elementType: O O C C C C C
charge: -0.045200 -0.232237 0.156028 -0.041604 -0.022363 -0.010198 0.195575
polarizability: 6.82856007e+01 6.51515281e-01 5.63649148e+01 2.30433106e+00 2.05676114e-02 4.71223643e+01
1716.lowfreq: -6.3694 -0.0007 -0.0002 0.0003 11.3021 19.7672 38.9016 75.8375 154.5636
frequency: 36.4322 75.7342 154.5582 320.6013 340.9343 425.6698 502.8184 586.4536 651.3602 763.5451 794.6006 821.6799 849.2724 875.9599 948.2400 991.5548 1037.1476 1043.2862 1064.4828 1102.8807 1142.1270 1162.1989 1215.6113 1223.4305 1250.2791 1327.3205 1400.4649 1436.2504 1444.9402 1472.8224 1670.3984 2980.0204 3054.4524 3090.8945 3101.0704 3136.9850 3189.0076 3208.7139 3507.9510
redmass: 4.0010 3.0668 3.6650 2.8150 2.5748 3.6658 1.9814 3.9423 1.3830 1.1546 1.6043 1.8805 4.3632 1.7271 2.4070 2.8229 1.2435 2.1314 1.2667 1.1523 1.7394 1.4064 1.5237 1.4546 1.4925 1.8640 1.7985 1.0973 1.0919 1.3824 8.4018 1.0652 1.0941 1.0518 1.0623 1.0913 1.1166 1.1142 1.0639
irintensity: 0.5952 0.1593 2.3618 2.4289 0.6364 16.5101 26.5785 25.6914 135.1193 0.2474 11.7734 14.6533 8.3019 10.8254 14.8594 36.0175 37.5577 220.7766 9.8012 0.3004 27.8122 1.7438 0.5189 0.2850 2.6673 41.0537 11.9422 31.0887 5.9864 6.5970 215.5397 16.9691 6.7977 24.4093 10.0018 4.9283 0.6912 32.2438 18.0915
temp: 298.150 k
press: 1.00000 atm
elementType: 8 8 6 6 6 6 6 1 1 1 1 1 1 1 1
symmnumber: 1
zpe: 319415.8 jmol-1
zpe.correction: 0.121659 hartree
zpe.thermalcorrener: 0.129037 hartree
zpe.thermalcorrenthalpy: 0.129981 hartree
zpe.thermalcorrgfe: 0.089044 hartree
zpe.sumelectzpe: -345.198257 hartree
zpe.sumelectthermal: -345.190879 hartree
zpe.sumelectthermalent: -345.189935 hartree
zpe.sumelectthermalfe: -345.230873 hartree
dipole: -0.3064 -1.4205 0.1142
dipole: 1.4576
quadrupole: -37.1269 -46.1183 -41.1935
quadrupole: -1.7190 1.9642 0.9859
quadrupole: 4.3526 -4.6387 0.2861 -1.7190 1.9642 0.9859
hfenergy: -345.3199162 hartree
pointgroup: C01 [X(C5H8O2)]
dipole: -0.1182873 -0.5114858 0.2307794 debye
dipolederiv: -0.9430306 0.4076833 -0.3517397 0.3089341 -0.4770448 0.1284189 -0.364384 0.1562613 -0.6161244 -0.6385921 -0.16697 0.0387475 0.0431201 -0.8090034 0.3161867 -0.1299705 0.2481274 -0.4945617 -0.0124279 0.0236139 0.0977934 -0.0201996 0.1178253 0.0159254 0.1553448 0.0361049 0.0513742 -0.1275588 -0.1182344 0.0091795 -0.1350638 -0.0344427 -0.0654309 -0.0415151 -0.0690946 0.0690932 0.0203969 0.0048973 0.0414616 0.04893 -0.0508469 -0.1552905 0.0383174 -0.1407582 -0.0541086 -0.0941553 -0.1247888 -0.0440768 -0.2490864 -0.0748034 0.0729081 -0.0249558 0.031961 0.096616 1.3451513 -0.0070119 0.3305176 -0.0336761 1.0459336 -0.5419272 0.4557038 -0.499473 0.6190095 0.0282154 0.0174338 0.0421766 0.048732 0.0516803 0.0832877 0.0334646 0.0681582 -0.042029 0.0735881 -0.0035399 -0.0345225 -0.0533898 -0.08535 0.078427 -0.0092359 0.0937066 0.0541274 -0.0702197 -0.0218589 -0.1022731 0.0078601 0.0668386 0.0330878 -0.1151312 0.0132622 0.0232949 0.0657385 0.0790519 -0.0114122 0.0875848 -0.0897702 -0.0142519 -0.0162636 0.0155024 0.0592923 0.0913219 0.0177345 -0.089285 0.0232227 0.0537113 0.024637 -0.0591876 -0.01808 -0.1002957 0.0466415 -0.0227187 0.0186845 0.0144562 0.0794928 0.0537973 -0.0006393 0.0955859 -0.0514515 0.0051677 0.024705 0.0376389 0.0624625 -0.0071582 -0.0912564 0.046503 -0.1060529 0.029172 0.209763 -0.1099972 0.0171098 -0.1538869 0.2129377 0.0614809 0.0319493 0.0747888 0.3565914 unknown
polarizability: 68.3276625|1.3462477|55.3400249|1.729384|-2.9163432|48.1051924 unknown
InChI: InChI=1S/C5H8O2/c6-5(7)3-4-1-2-4/h4,6H,1-3H2
charge 0 multiplicity 1
15 atoms
O  2.439148 -0.622446 0.582504
O  1.60982 1.103424 -0.729677
C  -1.093686 0.021396 -0.457963
C  -2.483912 -0.512781 -0.090232
C  -1.899218 0.698587 0.659312
C  0.139396 -0.802198 -0.11762
C  1.418268 0.017539 -0.14204
H  -1.009785 0.581098 -1.395128
H  -2.544413 -1.464374 0.44833
H  -3.307543 -0.34213 -0.789211
H  -2.324444 1.68655 0.463341
H  -1.569809 0.549155 1.692838
H  0.048329 -1.285384 0.872062
H  0.270586 -1.626426 -0.849439
H  3.272262 -0.080209 0.517523
