program: Gaussian 09
title: 000138438
version: EM64L-G09RevD.01
frameworkgroup: C1[X(C19H23NO)]
method: RPBEPBE
basis: SDD
operation: Freq
keyword: #p
keyword: freq=noraman
keyword: PBEPBE/SDD
title: #p freq=noraman PBEPBE/SDD
converged: YES YES NO NO
title: Mulliken charges:
elementType: O N C C C C C C C C C C C C C C C C C C C H H H H H H H H H H H H H H H H H H H H H H H
charge: -0.257511 -0.088013 -0.360934 -0.347833 -0.403813 -0.355148 -0.316662 -0.693693 0.354235 -0.387052 -0.336591 0.447431 -0.357330 -0.387188 -0.392042 0.262501 -0.353205 -0.377389 -0.219509 -0.203473 -0.251183 0.187925 0.189250 0.191122 0.190472 0.215660 0.214924 0.195440 0.194892 0.209583 0.210212 0.210651 0.210574 0.217094 0.252579 0.250205 0.229275 0.274093 0.215529 0.238995 0.250014 0.223253 0.225694 0.226964
chargesum: 0.00000
title: Mulliken charges with hydrogens summed into heavy atoms:
elementType: O N C C C C C C C C C C C C C C C C C C C
charge: -0.257511 -0.088013 0.016242 0.033762 0.026771 0.035185 0.103133 -0.055375 0.354235 -0.134473 -0.086385 0.447431 -0.128055 -0.113095 -0.176513 0.262501 -0.114210 -0.127374 0.003745 0.022221 -0.024220
polarizability: 4.56844100e+02 -2.99597709e+01 1.97735334e+02 8.17093945e+00 1.04448855e+01 1.23386937e+02
1716.lowfreq: -4.2606 -0.0015 0.0011 0.0017 4.4565 6.8501 13.8476 27.6129 35.3437
frequency: 13.6369 27.5552 35.1836 44.7502 53.4420 62.0970 74.5981 111.0052 114.0967 120.5585 141.5795 152.9453 161.0174 194.5338 218.2982 227.9416 262.0907 267.4971 308.1767 370.3619 401.6863 409.4042 419.0163 419.8289 465.9619 494.8304 515.2923 536.8735 542.9758 611.7172 623.6627 631.4122 694.6485 726.2823 734.1278 751.4370 764.2276 777.2673 805.4543 819.2884 826.2676 835.6688 838.8617 859.9373 889.7500 892.8238 909.0983 953.0138 963.5746 967.0912 978.3060 982.8861 987.6680 989.8850 991.1006 999.7287 1013.0361 1019.9738 1048.7702 1072.6392 1078.1871 1086.7611 1113.1609 1127.1190 1146.8092 1160.3165 1168.4440 1172.4747 1190.2504 1195.9167 1226.0672 1239.5830 1246.8876 1254.7682 1281.4076 1289.7712 1294.6194 1297.4666 1301.1641 1308.5341 1343.4387 1349.5613 1358.3870 1375.2244 1380.1966 1389.8056 1394.2514 1429.9124 1437.3419 1464.9277 1466.7251 1470.9765 1472.5355 1476.7989 1477.9207 1485.2012 1490.4202 1504.0411 1566.7295 1575.7206 1585.8482 1615.5359 1624.6733 2938.6328 2949.9901 2955.0792 2959.5225 2969.5865 2973.1249 2991.4913 2995.0868 3006.8906 3009.6906 3032.8235 3063.1334 3069.6161 3072.8726 3120.3265 3122.5948 3129.6999 3141.4374 3148.1339 3154.9350 3166.3231 3167.6925 3169.4230
redmass: 3.7156 4.6819 3.2634 4.1653 2.0132 4.2971 3.4296 4.4777 1.9796 3.1003 2.8516 2.0902 4.6272 4.7831 3.8067 1.1460 3.6090 5.1581 4.4183 4.0596 3.2987 2.9111 3.1996 3.7777 4.6278 3.8139 3.2659 3.5933 3.5132 6.4752 6.9160 6.9213 1.8379 1.0676 3.3496 1.1009 2.2960 3.7034 1.1613 6.1698 1.2488 1.2878 1.5833 3.9707 1.8450 1.2028 1.5139 1.3740 7.8823 1.3824 1.6158 2.4566 1.3132 1.3229 1.5475 2.6261 3.7821 2.1243 3.0923 2.6679 1.5246 2.0863 1.3693 2.7282 1.4298 1.6678 1.0930 1.1722 1.7144 1.5372 2.8705 1.2870 1.2989 2.1140 1.0831 1.1265 1.0960 1.3097 1.4149 1.3820 1.4485 2.3788 1.6386 5.4478 1.5684 1.2171 2.3158 4.1939 2.4066 1.0757 1.0730 1.3392 1.5860 1.0547 1.0935 1.1113 1.1180 2.4082 7.8913 5.9956 6.0576 6.1845 6.6734 1.0858 1.0555 1.0587 1.0590 1.0592 1.0363 1.0979 1.0593 1.1016 1.1062 1.1046 1.1050 1.1008 1.0993 1.0850 1.0895 1.0873 1.0935 1.0876 1.0956 1.0951 1.1006 1.0961
irintensity: 0.0487 0.2971 0.5666 0.0909 0.1727 0.3985 0.0948 1.5425 0.6421 1.2204 2.4432 3.8356 0.2530 0.2568 3.7989 0.0160 0.7972 3.3171 5.3850 3.1230 0.2596 2.1186 1.3544 0.8408 5.3720 0.8442 16.2171 27.2456 34.7841 0.3973 14.7450 0.2900 46.0962 12.1983 10.1938 0.3827 39.3221 28.4399 7.5785 1.1927 1.9316 3.5887 65.1888 23.5868 7.2367 1.6884 10.7433 7.6115 111.0770 0.2417 4.8066 2.6918 1.7208 2.6691 12.0356 4.3219 4.1932 10.1991 22.8198 15.0596 11.3760 6.5435 11.9967 13.8871 1.2611 167.6987 52.9481 49.1650 1.8762 0.0060 341.2282 12.1464 0.0602 92.1823 0.0251 0.0092 1.0563 1.2701 13.5145 10.4837 0.3015 43.3333 0.0442 0.1522 14.1845 11.3355 49.8811 1.0718 6.4439 0.3617 0.2570 2.5781 31.4813 12.9045 16.9556 41.2957 45.6870 126.8325 76.5273 5.4495 314.2034 100.9350 57.5037 60.3535 20.5914 9.2435 10.2085 92.4093 40.0308 1.3570 39.2244 8.3580 13.9744 35.8940 53.0818 115.6166 54.3757 8.2440 12.8704 1.2700 24.9208 6.7198 34.3695 11.8601 30.6299 10.6175
temp: 298.150 k
press: 1.00000 atm
elementType: 8 7 6 6 6 6 6 6 6 6 6 6 6 6 6 6 6 6 6 6 6 1 1 1 1 1 1 1 1 1 1 1 1 1 1 1 1 1 1 1 1 1 1 1
symmnumber: 1
zpe: 971073.6 jmol-1
zpe.correction: 0.369862 hartree
zpe.thermalcorrener: 0.390815 hartree
zpe.thermalcorrenthalpy: 0.391759 hartree
zpe.thermalcorrgfe: 0.316630 hartree
zpe.sumelectzpe: -866.236540 hartree
zpe.sumelectthermal: -866.215588 hartree
zpe.sumelectthermalent: -866.214644 hartree
zpe.sumelectthermalfe: -866.289773 hartree
dipole: -2.5332 0.0604 0.1217
dipole: 2.5369
quadrupole: -109.7205 -119.7838 -129.7325
quadrupole: 8.5927 0.0509 3.0551
quadrupole: 10.0251 -0.0382 -9.9869 8.5927 0.0509 3.0551
hfenergy: -866.6064027 hartree
pointgroup: C01 [X(C19H23N1O1)]
dipole: 0.9956599 -0.0423347 -0.0550058 debye
polarizability: 457.3977628|18.5334186|140.3750691|-21.2200955|-33.1804196|180.1935389 unknown
InChI: InChI=1S/C19H23NO/c1-2-3-4-8-15-21-19-13-11-17(12-14-19)16-20-18-9-6-5-7-10-18/h5-7,9-14,16H,2-4,8,15H2,1H3
charge 0 multiplicity 1
44 atoms
O  2.773989 0.742122 -0.895189
N  -3.568813 -0.240837 0.319023
C  6.105518 -0.652867 0.341973
C  7.570248 -0.356017 -0.051799
C  5.089972 0.19682 -0.456518
C  8.595935 -1.200634 0.737971
C  3.644898 -0.122004 -0.069885
C  10.055944 -0.907705 0.329997
C  1.389747 0.630073 -0.737699
C  0.611349 1.484891 -1.560879
C  0.752072 -0.261944 0.169178
C  -1.446844 0.558604 -0.576559
C  -0.788989 1.445839 -1.476995
C  -0.651603 -0.290385 0.241407
C  -2.913024 0.536231 -0.511338
C  -4.987082 -0.307874 0.308499
C  -5.771212 -0.226753 -0.880555
C  -5.643414 -0.531338 1.55084
C  -7.176183 -0.338279 -0.814448
C  -7.048375 -0.624943 1.610879
C  -7.823479 -0.527703 0.429438
H  5.897892 -1.731677 0.181255
H  5.975466 -0.467564 1.428798
H  7.782717 0.721622 0.107693
H  7.70264 -0.541753 -1.137979
H  5.278461 1.273749 -0.283826
H  5.217538 0.01775 -1.541311
H  8.467941 -1.009462 1.82304
H  8.376846 -2.277161 0.583966
H  3.404848 -1.186973 -0.270198
H  3.462268 0.088901 1.004357
H  10.310444 0.155231 0.501989
H  10.217533 -1.121037 -0.743531
H  10.769378 -1.523412 0.907851
H  1.12718 2.161532 -2.248566
H  1.338918 -0.925451 0.810723
H  -1.38723 2.10909 -2.114336
H  -1.16561 -0.967887 0.931031
H  -3.435444 1.239324 -1.19652
H  -5.27546 -0.115642 -1.85234
H  -5.027894 -0.619935 2.451881
H  -7.767626 -0.2879 -1.736049
H  -7.540738 -0.78438 2.576888
H  -8.914523 -0.615064 0.475642
