program: Gaussian 09
title: 000138436
version: EM64L-G09RevD.01
frameworkgroup: C1[X(C7H12O2)]
method: RPBEPBE
basis: SDD
operation: Freq
keyword: #pfreq=noraman
keyword: PBEPBE/SDD
title: #p freq=noraman PBEPBE/SDD
converged: YES YES NO NO
title: Mulliken charges:
elementType: O O C C C C C C C H H H H H H H H H H H H
charge: -0.430604 -0.230949 0.307323 -0.513147 -0.490391 -0.417388 -0.442100 -0.768144 0.125395 0.258056 0.215979 0.207373 0.252603 0.223038 0.201784 0.222632 0.218354 0.222056 0.216244 0.245379 0.376505
chargesum: 0.00000
title: Mulliken charges with hydrogens summed into heavy atoms:
elementType: O O C C C C C C C
charge: -0.054099 -0.230949 0.307323 -0.039112 -0.030415 0.007435 -0.001113 -0.084464 0.125395
polarizability: 8.35230068e+01 6.83903852e-02 7.58076100e+01 2.35999994e+00 2.22863025e+00 7.27587236e+01
1716.lowfreq: -20.5746 -0.0007 -0.0006 -0.0005 6.5545 14.6362 26.5623 38.9349 182.8339
frequency: 22.3420 37.1515 182.7959 245.2717 255.5361 283.1682 320.1917 350.7960 435.1178 520.4266 538.2886 591.3612 607.5868 701.0703 732.6316 790.4877 843.2826 856.6379 905.5141 912.0758 925.9051 994.4917 1021.3928 1032.2863 1049.9687 1063.7421 1119.8599 1149.6679 1188.6282 1209.2477 1230.0915 1249.4099 1274.7180 1298.7622 1305.4071 1314.9112 1324.1782 1387.2876 1465.0184 1469.7918 1472.2105 1475.0064 1483.4067 1488.9199 1644.4464 2982.6692 2991.3640 2992.3218 2995.5961 3015.4355 3055.3337 3064.3320 3075.1173 3078.5554 3084.2553 3098.3808 3514.0257
redmass: 3.8257 3.8185 2.5240 2.9652 1.1418 2.3083 1.8867 2.9056 3.9709 4.0929 1.9969 2.0417 1.5162 2.9477 4.8428 1.6007 2.0478 2.1281 2.1711 2.1189 1.4989 1.6931 2.4859 1.8467 1.4372 1.6462 1.9059 2.4979 2.2408 1.5540 1.4183 1.3696 1.5343 1.3958 1.3922 1.5204 1.5646 1.1963 1.0785 1.0782 1.0562 1.0822 1.0700 1.0912 8.6853 1.0356 1.0626 1.0667 1.0615 1.0625 1.0984 1.1018 1.1001 1.1013 1.1032 1.0998 1.0640
irintensity: 0.1512 0.3771 0.0112 0.2363 0.2017 1.4522 1.2831 7.5422 10.4815 4.9293 6.1197 44.7740 97.1278 5.9081 22.0283 6.1085 3.5692 4.1661 14.7196 1.8267 5.7396 17.7265 227.8427 13.6142 2.7025 20.8609 13.4244 1.1508 1.9093 2.1273 1.3351 2.7578 6.9381 11.3450 1.3088 7.2884 0.7604 7.8604 3.1441 24.1592 3.0962 9.6247 6.3481 14.6256 207.2417 23.2840 33.9720 24.5512 36.8403 41.8579 22.7468 35.4830 18.5848 15.5918 57.3161 22.0684 20.4302
temp: 298.150 k
press: 1.00000 atm
elementType: 8 8 6 6 6 6 6 6 6 1 1 1 1 1 1 1 1 1 1 1 1
symmnumber: 1
zpe: 470837.5 jmol-1
zpe.correction: 0.179333 hartree
zpe.thermalcorrener: 0.188628 hartree
zpe.thermalcorrenthalpy: 0.189572 hartree
zpe.thermalcorrgfe: 0.143859 hartree
zpe.sumelectzpe: -423.681627 hartree
zpe.sumelectthermal: -423.672332 hartree
zpe.sumelectthermalent: -423.671388 hartree
zpe.sumelectthermalfe: -423.717101 hartree
dipole: -0.2797 1.2831 0.9780
dipole: 1.6374
quadrupole: -50.2967 -57.4355 -56.1933
quadrupole: -0.9990 1.7874 -3.8405
quadrupole: 4.3452 -2.7937 -1.5515 -0.9990 1.7874 -3.8405
hfenergy: -423.8609599 hartree
pointgroup: C01 [X(C7H12O2)]
dipole: 0.1671179 0.609071 0.1269307 debye
dipolederiv: -0.8197479 0.4626428 -0.1080551 0.4179119 -0.6740824 0.1655705 -0.1545173 0.2150102 -0.4215658 -0.5752909 -0.1781943 -0.1783661 0.0663395 -0.9318002 -0.0713148 -0.1716432 -0.218868 -0.3799107 -0.1177692 -0.0642093 -0.0470443 -0.1553396 -0.0789409 -0.0743054 -0.0360196 -0.0412439 0.0264946 -0.0129517 0.0195458 0.0279591 -0.0261955 0.0020619 -0.0067785 0.0166945 0.0336509 0.0611252 0.0841595 0.0709552 0.0341379 0.0600821 0.0611867 0.0085419 -0.0649608 0.0067905 0.037316 0.1015326 0.0001306 0.0211055 0.0687127 0.0984911 0.0583588 0.0344385 0.0671194 0.044683 0.0698757 0.0637091 0.0508262 0.0371429 0.0537485 0.0521929 0.0196595 -0.0033204 0.0505679 -0.0124515 0.0031774 -0.0268686 0.0484714 0.0533562 -0.0026085 0.0234557 -0.0229141 0.0496419 1.1186723 -0.1252869 0.4598332 -0.2268072 1.2906419 0.0678191 0.5368559 0.1360869 0.3523518 0.0661639 -0.0749849 0.0344161 -0.0414533 -0.0567731 0.0057379 0.0342688 -0.0501615 0.0843691 0.0312099 0.0014756 -0.0248995 -0.0020433 0.0837728 -0.012901 -0.0218955 0.0341826 -0.1790048 -0.0213882 -0.0996473 -0.0499345 -0.0738897 -0.0351945 -0.0805849 -0.034713 -0.1135988 -0.0240956 0.0163861 0.1038544 -0.0674269 0.0750146 0.0018219 0.0681311 -0.0536092 0.0788316 -0.0072613 -0.0030806 0.0885067 0.028091 0.1352522 -0.1211363 -0.0454949 0.0516634 -0.0599178 0.0493033 -0.0832418 -0.0557342 -0.0722649 -0.1219348 0.0178918 -0.0562816 -0.1050104 -0.0372433 -0.0346018 -0.0941105 -0.0808512 0.1265481 -0.0842909 0.0216581 0.0769669 0.1007354 0.0559571 0.0000428 0.0148338 -0.0394428 -0.1131029 -0.0240855 -0.012364 -0.0990004 -0.0747125 -0.0629441 -0.0576411 0.0225177 -0.0567676 0.0977579 -0.0865246 -0.0035681 0.1014598 0.095617 0.0454262 -0.0285268 -0.0681134 -0.0783009 -0.1092114 -0.0587681 0.0550141 -0.0621897 -0.0770907 -0.0556109 0.0012821 0.0268419 0.1037138 -0.0034484 0.117774 -0.041292 0.0084333 -0.0209369 0.0602109 0.0751821 0.2559522 -0.0642918 -0.0800525 -0.1253686 0.2155065 -0.1017526 -0.0982795 -0.0674435 0.3002479 unknown
polarizability: 83.0916622|-2.476666|76.6997718|1.7518182|1.632226|72.2979063 unknown
InChI: InChI=1S/C7H12O2/c1-7(6(8)9)4-2-3-5-7/h8H,2-5H2,1H3
charge 0 multiplicity 1
21 atoms
O  -2.115071 0.721735 -0.669196
O  -1.419084 -1.481113 -0.680402
C  -0.011819 0.249238 0.464389
C  0.968464 -0.918956 0.836751
C  0.830378 1.175608 -0.489557
C  2.260321 -0.716666 -0.015894
C  1.82493 0.214173 -1.17721
C  -0.536474 1.024496 1.702578
C  -1.207049 -0.298677 -0.328042
H  0.494184 -1.888388 0.607904
H  1.189566 -0.902857 1.918899
H  1.385075 1.899483 0.139414
H  0.197379 1.750842 -1.18586
H  2.680943 -1.673919 -0.370587
H  3.043056 -0.213683 0.5843
H  2.673366 0.742399 -1.647672
H  1.314122 -0.370582 -1.966507
H  -1.127546 0.369849 2.369061
H  0.322722 1.411705 2.279876
H  -1.17218 1.873961 1.401312
H  -2.865182 0.32075 -1.186357
