program: Gaussian 09
title: 000138434
version: EM64L-G09RevD.01
frameworkgroup: C1[X(C8H17ClO4)]
method: RPBEPBE
basis: SDD
operation: Freq
keyword: #p
keyword: freq=noraman
keyword: PBEPBE/SDD
title: #p freq=noraman PBEPBE/SDD
converged: YES YES NO NO
title: Mulliken charges:
elementType: Cl O O O O C C C C C C C C H H H H H H H H H H H H H H H H H
charge: -0.045060 -0.268507 -0.284250 -0.262635 -0.451857 -0.246379 -0.246884 -0.244839 -0.249719 -0.242730 -0.167793 -0.319880 -0.590852 0.173811 0.210035 0.180375 0.206257 0.204278 0.179620 0.180370 0.211422 0.179814 0.203128 0.186247 0.218950 0.200743 0.200630 0.272069 0.248147 0.365490
chargesum: 0.00000
title: Mulliken charges with hydrogens summed into heavy atoms:
elementType: Cl O O O O C C C C C C C C
charge: -0.045060 -0.268507 -0.284250 -0.262635 -0.086367 0.137468 0.139748 0.139059 0.142072 0.140212 0.237404 0.081493 -0.070637
polarizability: 1.28058457e+02 -7.77293908e+00 1.23224978e+02 -1.45064644e+00 -5.22335839e-01 8.41608234e+01
1716.lowfreq: -13.8680 -7.9604 -0.0016 -0.0016 -0.0006 2.2769 19.1777 27.9577 32.8464
frequency: 18.5725 27.6022 32.5770 42.5126 48.9785 62.4449 117.4137 129.5132 145.9645 161.4473 178.5644 198.2566 208.4641 277.7544 302.5976 330.0474 337.3483 453.8957 483.8460 497.6148 501.2516 535.1061 613.3506 775.3100 785.9994 796.5186 867.2856 902.1937 916.0095 927.5862 962.6136 1003.4055 1011.4463 1034.1848 1040.3361 1048.2748 1067.9615 1072.6170 1098.1661 1102.5586 1108.9273 1122.6593 1171.0695 1186.5611 1198.2300 1209.4282 1211.6848 1223.0958 1248.3621 1254.4703 1296.8778 1328.9940 1333.9793 1338.4581 1345.7260 1377.8012 1387.0943 1399.6350 1415.2481 1430.8114 1450.3056 1451.1592 1451.6647 1457.8411 1470.2399 1471.1888 1472.7286 2893.7029 2914.8293 2919.3109 2924.5112 2934.0875 2939.0697 2962.8340 2978.4358 2980.5912 2985.0781 2992.7471 2994.8305 2997.5221 3061.3351 3073.0563 3144.5068 3534.9554
redmass: 5.6881 4.7665 5.4760 4.8056 4.7421 4.8591 4.3799 3.5751 4.1901 5.3889 2.4423 2.1831 2.2342 2.8916 2.9051 2.3265 2.5284 2.5517 1.6050 1.7827 2.2525 2.9742 4.9093 2.2932 2.4247 2.3147 2.5900 1.9979 1.9469 2.1109 1.9028 2.3116 2.0942 2.8429 2.5385 2.5141 2.1476 3.5109 2.3639 3.6828 3.2380 1.9251 1.1665 1.1422 1.1507 1.1602 1.1851 1.1770 1.1194 1.1363 1.1915 1.1825 1.2308 1.2588 1.3123 1.2406 1.3606 1.4719 1.5679 1.1131 1.0848 1.0836 1.0862 1.0850 1.0838 1.0888 1.0819 1.0640 1.0577 1.0581 1.0571 1.0589 1.0590 1.0719 1.0943 1.1027 1.1029 1.0991 1.1019 1.1017 1.0574 1.0964 1.1101 1.0660
irintensity: 0.4779 2.3257 3.5712 0.4567 1.6519 2.9049 3.6168 2.9498 20.4324 13.6201 1.7165 2.5126 6.1401 2.1414 1.2584 0.8561 0.3625 4.1785 91.7765 55.9292 61.3321 4.9467 21.2035 3.4781 8.5630 7.4461 15.2523 8.5480 33.8377 39.9722 20.5715 15.0618 59.9546 7.9023 17.7882 35.7512 39.9900 145.0653 23.4892 100.9611 32.6967 13.6453 7.1611 16.3360 0.9277 13.0409 27.9738 0.8706 5.0133 6.6087 23.5705 9.6351 36.7228 27.4461 9.5211 30.2756 0.5300 3.6149 2.6648 12.5531 11.4188 9.6130 17.9429 4.1545 7.4718 4.1436 11.5641 75.2194 3.8308 18.2130 55.2350 142.8372 179.0657 25.6874 40.2115 46.2566 43.0716 144.4326 44.3828 46.2993 28.4214 44.9017 12.2161 31.1169
temp: 298.150 k
press: 1.00000 atm
elementType: 17 8 8 8 8 6 6 6 6 6 6 6 6 1 1 1 1 1 1 1 1 1 1 1 1 1 1 1 1 1
symmnumber: 1
zpe: 652941.2 jmol-1
zpe.correction: 0.248692 hartree
zpe.thermalcorrener: 0.265042 hartree
zpe.thermalcorrenthalpy: 0.265986 hartree
zpe.thermalcorrgfe: 0.200671 hartree
zpe.sumelectzpe: -1074.839439 hartree
zpe.sumelectthermal: -1074.823089 hartree
zpe.sumelectthermalent: -1074.822145 hartree
zpe.sumelectthermalfe: -1074.887460 hartree
dipole: -0.5879 4.8011 -0.0750
dipole: 4.8376
quadrupole: -59.6772 -86.2558 -86.8371
quadrupole: -2.0747 -2.2411 1.7339
quadrupole: 17.9128 -8.6658 -9.2471 -2.0747 -2.2411 1.7339
hfenergy: -1075.088131 hartree
pointgroup: C01 [X(C8H17Cl1O4)]
dipole: -0.6560277 1.7848157 0.0799933 debye
polarizability: 131.2672027|-5.8042722|119.9906703|-1.5190614|1.3817031|84.1863856 unknown
InChI: InChI=1S/C8H17ClO4/c9-1-3-11-5-7-13-8-6-12-4-2-10/h10H,1-8H2
charge 0 multiplicity 1
30 atoms
Cl -1.493668 -2.850218 -0.435274
O  0.057256 1.894778 0.395594
O  2.428098 0.33051 -0.455154
O  -2.407387 0.278677 -0.301295
O  1.732674 -2.366393 0.352089
C  1.192191 2.401771 -0.377548
C  -1.234141 2.378025 -0.09485
C  2.44332 1.68165 0.104644
C  -2.319756 1.498267 0.508965
C  3.421893 -0.571423 0.143844
C  -3.233364 -0.753935 0.312802
C  3.002462 -1.985151 -0.262487
C  -3.17072 -1.996706 -0.558652
H  1.307378 3.499908 -0.228638
H  1.045942 2.203593 -1.461212
H  -1.386628 3.439613 0.205071
H  -1.289339 2.311661 -1.202703
H  2.4451 1.646558 1.215451
H  3.350605 2.229938 -0.235356
H  -3.298044 2.029894 0.502887
H  -2.051404 1.255687 1.559395
H  4.444296 -0.330282 -0.225224
H  3.403369 -0.477629 1.251179
H  -4.298297 -0.42019 0.367814
H  -2.889248 -0.978961 1.345192
H  3.742301 -2.719061 0.100842
H  2.951231 -2.045234 -1.370545
H  -3.303552 -1.744681 -1.620988
H  -3.905964 -2.749131 -0.235645
H  1.046495 -1.697734 0.089904
