program: Gaussian 09
title: 000138433
version: EM64L-G09RevD.01
frameworkgroup: C1[X(C10H10)]
method: RPBEPBE
basis: SDD
operation: Freq
keyword: #p
keyword: freq=noraman
keyword: PBEPBE/SDD
title: #p freq=noraman PBEPBE/SDD
converged: YES YES NO NO
title: Mulliken charges:
elementType: C C C C C C C C C C H H H H H H H H H H
charge: 0.358845 0.358845 -0.783100 -0.783100 -0.672737 -0.672737 -0.063829 -0.063829 -0.000015 -0.000016 0.223634 0.238244 0.238244 0.238244 0.238245 0.223634 0.221565 0.239150 0.221566 0.239149
chargesum: 0.00000
title: Mulliken charges with hydrogens summed into heavy atoms:
elementType: C C C C C C C C C C
charge: 0.358845 0.358845 -0.082977 -0.082978 -0.212023 -0.212022 -0.063829 -0.063829 -0.000015 -0.000016
polarizability: 2.92259769e+02 -3.77193526e+01 9.98456052e+01 3.12306065e-03 -9.91721887e-04 5.24889396e+01
1716.lowfreq: -11.8858 -2.1257 0.0001 0.0003 0.0005 2.8528 13.1851 46.2660 63.1685
frequency: 13.1763 46.2648 63.1685 102.8729 149.1360 159.8080 191.7740 222.7929 280.9272 318.7721 388.3098 451.1841 474.6331 529.8505 535.4147 537.3078 537.7049 558.5637 702.3844 707.6773 772.2599 912.5449 947.6063 947.6780 959.4421 1005.0875 1005.6299 1049.5739 1049.5810 1129.8006 1265.8241 1367.1034 1391.2758 1391.5733 1416.3725 1431.8125 1458.9223 1459.0262 1475.4588 1476.6045 1610.0439 1614.5208 2149.3201 2245.1778 2983.7347 2983.8552 3069.3655 3069.4023 3097.3660 3097.4634 3105.0061 3105.0182 3216.5020 3216.5631
redmass: 2.8105 3.8264 4.4641 3.7687 1.1865 1.0590 3.0940 5.7068 3.0982 5.7463 2.3857 6.8958 5.6773 2.4529 3.4335 5.1705 2.9569 4.8961 1.2265 1.2185 4.6065 2.4261 1.3318 1.3301 1.7531 1.3540 1.3589 1.4764 1.4771 2.3836 3.6710 3.5351 1.1960 1.2295 1.2609 1.4447 1.0456 1.0456 1.0566 1.0735 4.0925 4.3863 11.9773 11.9653 1.0356 1.0356 1.0983 1.0983 1.1002 1.1002 1.0615 1.0613 1.1157 1.1156
irintensity: 0.3432 1.8653 2.6465 0.0001 0.0000 1.5727 0.0008 1.6008 0.0000 4.9053 3.4597 0.0004 0.0008 8.9000 0.0021 13.5510 0.4813 0.0001 0.2986 0.0004 0.0922 0.0002 151.9034 0.0050 3.3958 0.0002 5.9911 13.4925 0.0042 0.0000 91.1032 0.0001 30.2725 0.0012 0.0134 0.0000 31.3621 0.0012 41.3392 0.0002 43.9628 0.0007 5.4374 0.0000 50.0450 0.0014 0.0855 34.7410 49.4904 0.0763 4.0467 0.0140 29.2754 0.0003
temp: 298.150 k
press: 1.00000 atm
elementType: 6 6 6 6 6 6 6 6 6 6 1 1 1 1 1 1 1 1 1 1
symmnumber: 1
zpe: 415392.7 jmol-1
zpe.correction: 0.158215 hartree
zpe.thermalcorrener: 0.170090 hartree
zpe.thermalcorrenthalpy: 0.171035 hartree
zpe.thermalcorrgfe: 0.118373 hartree
zpe.sumelectzpe: -386.212168 hartree
zpe.sumelectthermal: -386.200292 hartree
zpe.sumelectthermalent: -386.199348 hartree
zpe.sumelectthermalfe: -386.252009 hartree
dipole: 0.0000 0.0000 0.0050
dipole: 0.0050
quadrupole: -41.1237 -55.8464 -63.3140
quadrupole: 2.1991 -0.0003 0.0001
quadrupole: 12.3043 -2.4184 -9.8860 2.1991 -0.0003 0.0001
hfenergy: -386.3703823 hartree
pointgroup: C01 [X(C10H10)]
dipole: 0.0000032 0.0000186 -0.0019787 debye
dipolederiv: 0.591448 -0.0203655 0.0004517 -0.1818885 0.3086199 -0.0019893 0.0017149 -0.0014835 -0.0139079 0.591455 -0.0203659 -0.0004397 -0.1818819 0.3086188 0.0020012 -0.0016447 0.0015253 -0.0139076 -0.0914432 0.0447052 -0.0002653 -0.0308843 -0.1033811 0.0010076 0.0000415 0.0008665 0.0792196 -0.0914448 0.0447079 0.0002641 -0.0308837 -0.1033795 -0.0010196 -0.0000469 -0.0008836 0.0792197 -0.3216687 -0.1425596 0.0007494 -0.0592949 -0.1499459 -0.0014565 0.0005311 -0.0014916 -0.4005235 -0.3216667 -0.142558 -0.0007714 -0.059299 -0.1499507 0.0014428 -0.0006203 0.0014426 -0.400524 -0.1184684 0.0378992 -0.0002894 0.1963646 -0.1286814 0.0005603 -0.0012855 0.0002396 -0.059393 -0.1184774 0.0379103 0.0002899 0.1963728 -0.1286784 -0.0005586 0.0013011 -0.000241 -0.0593934 0.01847 -0.0047787 -0.000057 0.0094803 -0.0325615 0.0001152 -0.000319 0.0000838 -0.0369364 0.0184743 -0.0047856 0.000061 0.0094552 -0.0325618 -0.000115 0.0002886 -0.0000888 -0.0369366 -0.1964281 0.0222516 -0.0004135 -0.025672 0.0543107 0.0002579 -0.0000365 0.0003835 0.1133372 0.1004744 -0.0090412 0.0756137 -0.0024493 0.0088853 0.0793348 0.0224308 0.1135135 -0.0360844 0.1006108 -0.009608 -0.0752601 -0.0024363 0.0067757 -0.0797872 -0.0221353 -0.1139603 -0.0341955 0.1006143 -0.0096069 0.0752548 -0.0024258 0.0067652 0.079793 0.0221259 0.1139647 -0.0341948 0.1004719 -0.0090378 -0.0756149 -0.0024542 0.0088944 -0.0793336 -0.0224341 -0.1135122 -0.0360853 -0.1964274 0.022246 0.0004188 -0.0256787 0.0543102 -0.0002584 0.0000399 -0.0003872 0.1133374 -0.1334821 0.0040596 -0.0001596 0.0070626 0.08209 0.0006077 -0.0006644 0.0004534 0.186838 0.0504867 0.0774348 -0.0005109 0.0897269 -0.0461118 0.0014675 -0.0004064 0.0015085 0.2016461 -0.1334809 0.0040548 0.0001661 0.0070568 0.0820908 -0.0006067 0.0006945 -0.0004437 0.1868387 0.0504824 0.0774378 0.0005125 0.0897294 -0.0461088 -0.0014632 0.0004247 -0.0014895 0.2016458 unknown
polarizability: 292.207309|37.8528841|99.8980651|0.0031224|0.0009939|52.4889396 unknown
InChI: InChI=1S/C10H10/c1-9(2)7-5-6-8-10(3)4/h1,3H2,2,4H3
charge 0 multiplicity 1
20 atoms
C  -3.358205 -0.118387 -0.01025
C  3.358239 0.118371 -0.01014
C  -4.034884 1.249014 -0.018198
C  4.034956 -1.24901 -0.018166
C  -4.071823 -1.288401 -0.003943
C  4.071826 1.288404 -0.003816
C  -1.926386 -0.117168 -0.009629
C  1.92642 0.117115 -0.00958
C  -0.681176 -0.034332 -0.00963
C  0.681212 0.034248 -0.00962
H  -5.133083 1.14508 -0.018782
H  -3.735318 1.828551 -0.910552
H  -3.737184 1.837994 0.868599
H  3.737296 -1.838029 0.868618
H  3.735381 -1.828526 -0.910532
H  5.133151 -1.145047 -0.018777
H  -5.167328 -1.280316 -0.004444
H  -3.573093 -2.262862 0.001846
H  5.16733 1.280349 -0.004354
H  3.573068 2.262852 0.001952
