program: Gaussian 09
title: 000138432
version: EM64L-G09RevD.01
frameworkgroup: C1[X(C12H12)]
method: RPBEPBE
basis: SDD
operation: Freq
keyword: #p
keyword: freq=noraman
keyword: PBEPBE/SDD
title: #p freq=noraman PBEPBE/SDD
converged: YES YES NO NO
title: Mulliken charges:
elementType: C C C C C C C C C C C C H H H H H H H H H H H H
charge: 0.232856 0.232857 -0.516493 -0.516493 -0.290401 -0.312257 -0.312256 -0.290401 -0.241692 -0.238929 -0.238931 -0.241693 0.233483 0.241295 0.233483 0.241295 0.232785 0.226190 0.226190 0.232786 0.217703 0.215460 0.215461 0.217704
chargesum: 0.00000
title: Mulliken charges with hydrogens summed into heavy atoms:
elementType: C C C C C C C C C C C C
charge: 0.232856 0.232857 -0.041715 -0.041715 -0.057616 -0.086067 -0.086066 -0.057615 -0.023989 -0.023470 -0.023471 -0.023990
polarizability: 1.32320278e+02 -1.38289009e+00 1.23031704e+02 -9.27978140e-04 5.00410340e-03 8.84805852e+01
1716.lowfreq: -17.7131 -3.3741 -2.2721 -0.0006 0.0005 0.0006 81.8576 128.0241 198.8536
frequency: 81.7044 128.0219 198.8393 227.5341 245.4922 374.7248 411.0090 426.8514 445.5792 492.9676 511.2164 556.1116 597.1534 631.2142 640.0008 686.4620 721.6548 738.2081 780.8967 792.6638 824.7605 873.5859 894.5306 945.8043 946.4993 948.6453 957.0516 963.0530 974.4456 974.9002 985.8603 1007.0460 1018.5744 1090.7190 1125.2322 1161.5770 1161.9016 1172.9245 1181.0862 1189.1479 1223.9511 1231.6179 1237.8891 1276.8861 1349.6267 1366.1390 1398.7710 1406.2150 1449.1960 1459.5807 1591.3713 1609.5352 1648.7649 1650.2261 3007.9188 3017.4168 3076.1909 3091.3506 3091.8640 3098.5105 3099.5950 3101.3366 3125.1224 3126.1862 3144.7005 3146.4682
redmass: 2.5529 4.2908 3.2414 2.1226 2.7952 2.4789 3.1039 2.3437 4.0640 5.0418 3.9985 3.0376 5.1899 3.7506 3.2290 1.4156 1.7007 1.9166 1.3752 1.4963 1.9512 4.2891 1.8010 2.5251 2.2982 2.1701 1.3712 1.5752 1.3141 1.5686 2.0637 4.9937 2.0828 3.2020 1.6971 1.6122 1.6975 1.2276 1.0646 1.5643 1.3950 1.3936 1.2622 1.9941 1.3553 1.5939 1.8405 1.6990 1.0839 1.1126 9.8136 9.0189 6.0981 5.9650 1.0557 1.0618 1.1084 1.0844 1.0856 1.0944 1.0983 1.0857 1.0957 1.0958 1.1000 1.0998
irintensity: 0.4890 0.1746 0.1318 0.0982 0.2903 0.5996 6.3436 14.0177 3.4157 3.2700 0.2587 0.5005 1.4085 16.2782 0.1435 30.3668 122.9788 20.5594 7.0879 0.4106 2.0985 0.7588 0.0206 2.1795 2.8725 0.8072 0.1889 0.1630 0.0769 2.0498 6.5228 10.9319 6.7157 6.6259 0.0592 4.9262 2.3333 1.5596 1.7906 0.4175 12.3146 2.7836 2.3358 0.4020 3.7867 0.0021 1.8780 0.1492 8.3062 5.8601 7.2441 5.7619 0.0908 1.0073 36.6796 47.9557 3.4682 0.4899 8.8941 13.9152 33.3229 0.0016 1.7552 84.9845 70.5116 12.0488
temp: 298.150 k
press: 1.00000 atm
elementType: 6 6 6 6 6 6 6 6 6 6 6 6 1 1 1 1 1 1 1 1 1 1 1 1
symmnumber: 1
zpe: 521046.0 jmol-1
zpe.correction: 0.198456 hartree
zpe.thermalcorrener: 0.207914 hartree
zpe.thermalcorrenthalpy: 0.208858 hartree
zpe.thermalcorrgfe: 0.164295 hartree
zpe.sumelectzpe: -463.534622 hartree
zpe.sumelectthermal: -463.525164 hartree
zpe.sumelectthermalent: -463.524220 hartree
zpe.sumelectthermalfe: -463.568782 hartree
dipole: 0.0000 -0.0001 0.5060
dipole: 0.5060
quadrupole: -66.9384 -65.0751 -73.5070
quadrupole: -0.9269 -0.0002 0.0012
quadrupole: 1.5685 3.4317 -5.0002 -0.9269 -0.0002 0.0012
hfenergy: -463.7330776 hartree
pointgroup: C01 [X(C12H12)]
dipole: 0.0000038 -0.0000311 0.1990818 debye
dipolederiv: 0.0269009 0.0070856 -0.0275472 0.0287721 -0.0973616 0.0156406 -0.0596653 -0.031471 0.013303 0.0269023 0.0070773 0.0275486 0.0287548 -0.0973668 -0.0156747 0.0596686 0.0314402 0.0132993 0.0209328 -0.0467006 -0.0041396 -0.08246 0.0744624 0.0969268 -0.0230234 0.1403722 0.0565631 0.0209332 -0.0467061 0.0041273 -0.0824692 0.0745324 -0.0969182 0.0230031 -0.1403648 0.0564942 0.0221601 -0.0071428 -0.1825842 0.0581867 -0.0005263 -0.0816221 -0.1915417 -0.0762504 -0.1095027 0.1346733 -0.0141754 0.180444 -0.0745104 0.0291127 0.0245615 0.1540438 0.0039477 -0.2011207 0.1346647 -0.014122 -0.1804606 -0.0744661 0.0291223 -0.0244944 -0.1540769 -0.0038811 -0.2011161 0.022175 -0.0071927 0.1825782 0.0581363 -0.0005705 0.0816522 0.1915549 0.0762797 -0.1094684 -0.0821382 0.1354602 -0.0656046 0.0664527 0.0827693 -0.110862 -0.0748174 -0.0998757 -0.1075246 0.0019161 -0.196933 0.0060857 -0.1175367 0.0756244 -0.0190229 0.0537513 0.0019955 -0.1564042 0.0019121 -0.1969307 -0.006148 -0.1175215 0.0756174 0.0190946 -0.0537901 -0.0019212 -0.1563969 -0.0821338 0.1354468 0.0656422 0.0664353 0.0827069 0.1109144 0.0748353 0.0999252 -0.1074702 0.0197494 0.1039102 0.1006841 0.049514 -0.0368962 -0.1131348 0.0744726 -0.0673452 -0.0163133 -0.1266852 -0.0609823 -0.0918321 -0.0068381 0.0509437 0.0050999 -0.0632986 -0.0131859 0.0411231 0.0197429 0.1039417 -0.1006556 0.0495396 -0.036949 0.1131281 -0.0744591 0.0673347 -0.0162531 -0.1266798 -0.061008 0.0918201 -0.0068559 0.0509403 -0.0050978 0.0633017 0.0131907 0.0411205 0.0733355 0.0625198 0.0314765 -0.009908 -0.1057012 0.0755137 0.0291616 0.0628015 0.1164882 0.0547574 -0.003157 -0.0276391 0.0589505 -0.1288976 -0.0161568 -0.0242646 -0.0361257 0.1257329 0.0547595 -0.0031643 0.0276407 0.058944 -0.1289133 0.0160822 0.0242836 0.0360528 0.1257448 0.0733334 0.0625265 -0.031457 -0.0099023 -0.1056611 -0.0755771 -0.0291621 -0.0628669 0.1164511 -0.0487662 -0.0814211 0.1134685 -0.0614646 0.0269583 0.0655924 0.1270383 0.0760148 0.0978265 -0.0968387 0.1015411 -0.0771371 0.0908517 0.029525 0.0017461 -0.0887233 0.0132843 0.139819 -0.0968318 0.1015182 0.0771751 0.090826 0.0295296 -0.0017808 0.0887576 -0.0133194 0.1398091 -0.0487749 -0.0813912 -0.113486 -0.0614309 0.0269988 -0.0656107 -0.1270498 -0.0760321 0.0977953 unknown
polarizability: 132.3714028|-1.197873|122.9805797|-0.0010269|0.0049847|88.4805852 unknown
InChI: InChI=1S/C12H12/c1-2-6-12-8-4-3-7-11(12,5-1)9-10-12/h1-8H,9-10H2
charge 0 multiplicity 1
24 atoms
C  -0.003668 0.803612 0.265988
C  0.003707 -0.803697 0.265754
C  0.204028 0.757161 1.839202
C  -0.203935 -0.757702 1.838989
C  1.118338 1.486594 -0.492195
C  -1.353031 1.390106 -0.104466
C  1.353056 -1.390085 -0.104914
C  -1.118325 -1.486461 -0.492583
C  2.244671 0.804607 -0.854001
C  -2.383912 0.640795 -0.595869
C  2.383919 -0.640635 -0.596142
C  -2.244674 -0.804372 -0.854148
H  -0.431446 1.435763 2.433787
H  1.262654 0.91248 2.10985
H  0.431561 -1.436477 2.433353
H  -1.262552 -0.913099 2.109628
H  0.999501 2.550529 -0.738713
H  -1.462083 2.477605 0.016107
H  1.462111 -2.477619 0.015346
H  -0.999496 -2.550325 -0.739411
H  3.060961 1.318846 -1.375768
H  -3.334623 1.123457 -0.854508
H  3.33462 -1.123222 -0.854955
H  -3.060983 -1.318463 -1.376031
