program: Gaussian 09
title: 000138425
version: EM64L-G09RevD.01
frameworkgroup: C1[X(C5H6)]
method: RPBEPBE
basis: SDD
operation: Freq
keyword: #p
keyword: freq=noraman
keyword: PBEPBE/SDD
title: #p freq=noraman PBEPBE/SDD
converged: NO NO NO NO
title: Mulliken charges:
elementType: C C C C C H H H H H H
charge: -0.262315 -0.262316 -0.479492 -0.232018 -0.232021 0.252763 0.252764 0.234417 0.239592 0.244313 0.244314
chargesum: 0.00000
title: Mulliken charges with hydrogens summed into heavy atoms:
elementType: C C C C C
charge: -0.009552 -0.009552 -0.005483 0.012295 0.012292
polarizability: 5.25612654e+01 -3.94909169e-05 5.09351690e+01 -8.42706624e-01 -6.61908590e-05 3.64111954e+01
1716.lowfreq: -0.0009 -0.0006 -0.0003 13.7342 14.9218 22.4290 413.9105 438.9131 728.2387
frequency: 413.9105 438.9033 728.2387 766.3375 780.2605 815.7521 836.5852 864.1803 918.9141 941.6057 1003.5249 1011.7022 1013.0326 1078.9327 1079.8559 1165.7738 1182.5802 1245.6976 1265.2016 1439.3454 1537.4731 3061.7084 3151.2634 3172.2549 3180.6818 3187.7729 3203.7100
redmass: 2.0502 2.3816 1.2489 1.8589 1.8694 3.3407 1.8232 2.3590 1.7505 1.5695 1.5319 1.1624 1.3041 1.2785 1.4389 2.3563 1.3111 2.7953 1.7801 1.1640 5.5209 1.0562 1.0848 1.1145 1.0913 1.1063 1.1117
irintensity: 11.2215 0.8722 106.1103 41.5961 0.0168 0.1033 4.5565 8.5181 2.1522 12.8320 3.5451 9.9326 1.7113 9.9110 5.3913 3.6790 0.0031 2.8280 26.2306 4.7568 8.3864 36.4783 6.0240 4.8607 12.9830 52.7369 4.1064
temp: 298.150 k
press: 1.00000 atm
elementType: 6 6 6 6 6 1 1 1 1 1 1
symmnumber: 1
zpe: 236173.9 jmol-1
zpe.correction: 0.089954 hartree
zpe.thermalcorrener: 0.094167 hartree
zpe.thermalcorrenthalpy: 0.095111 hartree
zpe.thermalcorrgfe: 0.063413 hartree
zpe.sumelectzpe: -193.642501 hartree
zpe.sumelectthermal: -193.638288 hartree
zpe.sumelectthermalent: -193.637344 hartree
zpe.sumelectthermalfe: -193.669041 hartree
dipole: 0.5622 0.0000 0.0741
dipole: 0.5670
quadrupole: -28.7460 -29.5481 -30.4594
quadrupole: 0.0000 -1.9742 0.0000
quadrupole: 0.8385 0.0364 -0.8749 0.0000 -1.9742 0.0000
hfenergy: -193.7324548 hartree
pointgroup: C01 [X(C5H6)]
dipole: 0.2229031 0.0000099 -0.0089757 debye
dipolederiv: -0.1112579 -0.0185326 -0.0135598 -0.0475647 -0.2242124 -0.0686805 -0.0322009 -0.0556058 0.054457 -0.1112626 0.0185388 -0.013563 0.0475725 -0.2242123 0.0686819 -0.032208 0.05561 0.0544481 0.0294162 0.0000039 0.0715628 0.0000031 0.0104462 0.0000054 0.0377027 -0.0000003 0.0437212 0.101936 0.0293291 0.1658427 -0.1510032 0.0119863 0.1138426 0.2285683 0.1868394 -0.1948361 0.1019325 -0.0293169 0.1658513 0.151018 0.0119872 -0.1138312 0.2285808 -0.186813 -0.1948264 0.0412669 0.0165581 -0.0613312 0.0083637 0.0452129 0.1101702 -0.0620204 0.1350634 0.013311 0.041269 -0.0165598 -0.0613223 -0.0083618 0.0452088 -0.1101744 -0.0620091 -0.1350705 0.0133201 0.0610683 -0.0000007 -0.0143713 -0.0000017 0.0929372 -0.0000032 0.0572309 -0.0000007 -0.1296487 -0.175005 -0.0000176 -0.0384811 -0.0000176 0.166627 -0.0000039 -0.0715047 -0.000005 0.0541132 0.0103263 -0.0834833 -0.10031 -0.0880702 0.0319982 -0.0685505 -0.146066 -0.0937053 0.1429726 0.0103104 0.0834808 -0.1003182 0.0880619 0.0320209 0.0685435 -0.1460735 0.0936877 0.142968 unknown
polarizability: 52.2761011|0.0001511|50.935169|2.2878502|-0.0002262|36.6963596 unknown
InChI: InChI=1S/C5H6/c1-2-5-3-4(1)5/h1-2,4-5H,3H2
charge 0 multiplicity 1
11 atoms
C  0.332165 -0.781225 0.520703
C  0.332088 0.781298 0.520684
C  1.348114 0.000068 -0.353725
C  -1.062159 -0.68628 -0.128145
C  -1.062219 0.686201 -0.128179
H  0.643921 -1.434645 1.336419
H  0.643792 1.43476 1.336385
H  1.22715 0.000051 -1.443085
H  2.389527 0.000127 -0.0023
H  -1.709172 -1.445985 -0.573701
H  -1.709308 1.445829 -0.573757
