program: Gaussian 09
title: 000138424
version: EM64L-G09RevD.01
frameworkgroup: C1[X(C11H15Cl)]
method: RPBEPBE
basis: SDD
operation: Freq
keyword: #p
keyword: freq=noraman
keyword: PBEPBE/SDD
title: #p freq=noraman PBEPBE/SDD
converged: YES YES NO YES
title: Mulliken charges:
elementType: Cl C C C C C C C C C C C H H H H H H H H H H H H H H H
charge: -0.095084 0.196790 0.186658 0.186722 0.385150 0.385134 -0.614179 -0.856036 -0.864757 -0.864708 -0.829058 -0.828992 0.241704 0.241746 0.239429 0.236617 0.253272 0.236564 0.253258 0.236618 0.236560 0.253343 0.233023 0.231943 0.233019 0.253328 0.231938
chargesum: 0.00000
title: Mulliken charges with hydrogens summed into heavy atoms:
elementType: Cl C C C C C C C C C C C
charge: -0.095084 0.196790 0.186658 0.186722 0.385150 0.385134 -0.614179 -0.133157 -0.138304 -0.138272 -0.110750 -0.110707
polarizability: 1.61564266e+02 -2.58735173e-04 1.52297138e+02 -2.05570757e-03 5.38156951e-04 7.34790790e+01
1716.lowfreq: -24.2605 -2.7125 -0.0022 -0.0017 -0.0014 6.6976 15.8422 73.8363 83.1968
frequency: -23.5070 73.8131 83.0508 91.5118 133.0319 153.3581 175.2589 181.3328 209.9327 261.7537 307.0544 351.9994 352.7592 355.7497 361.4919 379.3711 400.5511 442.5591 499.6667 569.7482 577.4424 585.5374 590.8814 720.5969 751.1741 819.8536 917.5689 990.5120 1004.4900 1008.2616 1020.2520 1025.6024 1036.3986 1050.0657 1056.2472 1077.1972 1080.4591 1090.2829 1213.2445 1320.6298 1343.5426 1389.1714 1395.2006 1395.2518 1400.6092 1401.9033 1409.5405 1424.0154 1450.5835 1459.7978 1469.2776 1472.3505 1481.1208 1485.3127 1487.0181 1495.9103 1501.1655 1508.8051 1563.8126 1597.1688 2968.5428 2972.4888 2973.4354 2981.5792 2981.9686 3048.4925 3048.9606 3054.9302 3055.1386 3061.1282 3096.7770 3110.2452 3110.4961 3119.4762 3120.0003
redmass: 1.0506 1.9297 1.7382 1.8061 1.2626 1.5849 1.6935 1.0953 1.8186 6.9546 3.9698 3.2240 4.2874 2.6754 3.6881 3.0511 2.4430 4.7619 4.8433 4.2527 2.5665 3.4031 4.2175 3.8974 3.5560 2.8965 2.7042 1.4412 1.3541 1.3799 1.4018 1.9237 1.4954 1.5720 1.7356 2.1297 2.5145 1.9710 5.9085 8.4534 5.9268 1.6193 2.1786 1.2133 1.2067 1.2348 1.2876 3.2155 1.1493 1.1549 1.0929 1.0577 1.1126 1.1166 1.0979 1.0508 1.0503 1.0606 5.2851 7.0309 1.0456 1.0433 1.0434 1.0409 1.0409 1.0931 1.0937 1.0969 1.0968 1.0873 1.0988 1.0949 1.0951 1.0947 1.0947
irintensity: 0.1486 0.0323 0.0014 0.2492 0.0023 3.5017 3.3653 0.0103 2.8102 0.2472 7.0573 0.3376 0.4747 1.5617 0.8625 1.2066 0.1503 0.0586 3.8457 0.1969 0.0964 0.0623 0.1546 13.4449 0.0411 2.1750 59.7135 1.4809 11.8945 13.4441 0.3182 19.5179 3.5205 1.8575 0.9951 11.7116 8.2428 1.1687 16.6868 0.0437 0.5825 5.2844 7.2113 0.0506 13.6423 36.9369 13.8230 0.3543 4.2343 1.8751 1.4174 54.1017 16.4986 48.3511 20.6206 2.7323 0.0743 2.9149 5.2346 0.2491 42.8507 35.6340 24.1940 57.3498 1.1048 55.5193 0.2901 0.6282 33.4746 14.3409 28.0017 17.1340 15.1551 0.3487 9.4033
temp: 298.150 k
press: 1.00000 atm
elementType: 17 6 6 6 6 6 6 6 6 6 6 6 1 1 1 1 1 1 1 1 1 1 1 1 1 1 1
symmnumber: 1
zpe: 593084.0 jmol-1
zpe.correction: 0.225894 hartree
zpe.thermalcorrener: 0.239016 hartree
zpe.thermalcorrenthalpy: 0.239961 hartree
zpe.thermalcorrgfe: 0.186890 hartree
zpe.sumelectzpe: -887.333971 hartree
zpe.sumelectthermal: -887.320848 hartree
zpe.sumelectthermalent: -887.319904 hartree
zpe.sumelectthermalfe: -887.372975 hartree
dipole: 2.7067 -0.0001 0.0317
dipole: 2.7069
quadrupole: -80.2517 -71.5786 -82.2447
quadrupole: 0.0010 0.0068 0.0000
quadrupole: -2.2267 6.4464 -4.2197 0.0010 0.0068 0.0000
hfenergy: -887.5598646 hartree
pointgroup: C01 [X(C11H15Cl1)]
dipole: -1.0648696 0.000135 -0.0138766 debye
polarizability: 161.5641207|-0.0013592|152.2971381|0.1129932|0.0010677|73.4792239 unknown
InChI: InChI=1S/C11H15Cl/c1-6-7(2)9(4)11(12)10(5)8(6)3/h1-5H3
charge 0 multiplicity 1
27 atoms
Cl 3.218149 -0.000338 0.012004
C  -1.430292 0.00003 0.013773
C  -0.723703 1.237188 -0.000498
C  -0.723779 -1.237175 -0.000553
C  0.704577 1.253783 0.003784
C  0.7045 -1.253834 0.003742
C  1.363651 -0.000064 0.010358
C  -2.952882 0.000044 0.03388
C  -1.500804 2.547308 -0.023872
C  -1.50099 -2.547232 -0.024005
C  1.46375 2.570548 0.00669
C  1.463748 -2.570542 0.00661
H  -3.355186 -0.888199 0.547951
H  -3.355216 0.888851 0.546933
H  -3.372164 -0.000562 -0.992975
H  -1.980264 2.751079 0.954456
H  -0.857498 3.408381 -0.257419
H  -2.307599 2.52142 -0.778407
H  -0.85783 -3.408319 -0.257902
H  -1.980214 -2.751161 0.954408
H  -2.307983 -2.52112 -0.778314
H  2.547148 2.410382 0.100881
H  1.290265 3.13536 -0.92919
H  1.142042 3.215317 0.844822
H  1.290338 -3.13533 -0.929298
H  2.547138 -2.41025 0.10082
H  1.142095 -3.215362 0.844722
