program: Gaussian 09
title: 000138423
version: EM64L-G09RevD.01
frameworkgroup: C1[X(C6H2Cl2O2)]
method: RPBEPBE
basis: SDD
operation: Freq
keyword: #p
keyword: freq=noraman
keyword: PBEPBE/SDD
title: #p freq=noraman PBEPBE/SDD
converged: NO NO NO NO
title: Mulliken charges:
elementType: Cl Cl O O C C C C C C H H
charge: 0.082688 0.082680 -0.153703 -0.153708 -0.205140 -0.205126 0.243150 0.243160 -0.242375 -0.242369 0.275371 0.275371
chargesum: 0.00000
title: Mulliken charges with hydrogens summed into heavy atoms:
elementType: Cl Cl O O C C C C C C
charge: 0.082688 0.082680 -0.153703 -0.153708 -0.205140 -0.205126 0.243150 0.243160 0.032996 0.033002
polarizability: 1.38458819e+02 8.34758406e-04 9.91428220e+01 -2.97075242e-03 4.20824171e-03 3.24611757e+01
1716.lowfreq: -6.1814 -4.9093 0.0013 0.0022 0.0036 9.3971 74.9934 85.5875 191.2871
frequency: 74.9923 85.5766 191.2871 220.9985 238.4933 264.2377 332.0364 341.7928 440.1947 488.2917 511.5334 556.0324 600.6341 680.7914 788.6582 824.2124 850.6652 889.4947 989.4160 1002.1550 1089.6849 1213.5386 1263.6244 1341.7933 1539.9199 1560.0759 1575.2278 1631.8366 3151.2187 3175.4837
redmass: 21.6741 8.1601 31.0237 8.4959 18.9524 4.7814 19.4527 16.8437 11.8115 8.7620 10.5983 4.9642 2.5035 9.0738 7.5125 9.6769 1.9078 9.7236 1.2953 5.6179 1.6604 4.6421 2.3639 1.7069 11.8539 12.3826 10.6274 7.4337 1.0872 1.1013
irintensity: 0.0000 11.1937 0.0193 0.0051 0.3750 0.0000 1.6465 2.2646 2.3449 0.0000 48.8445 0.1936 1.5041 0.3046 0.0000 13.7574 61.5232 51.4013 0.0001 128.6702 36.9108 78.5769 46.9554 0.0510 139.8638 27.9025 246.1707 0.0437 0.0068 2.9349
temp: 298.150 k
press: 1.00000 atm
elementType: 17 17 8 8 6 6 6 6 6 6 1 1
symmnumber: 1
zpe: 166962.2 jmol-1
zpe.correction: 0.063593 hartree
zpe.thermalcorrener: 0.072411 hartree
zpe.thermalcorrenthalpy: 0.073355 hartree
zpe.thermalcorrgfe: 0.028502 hartree
zpe.sumelectzpe: -1299.652882 hartree
zpe.sumelectthermal: -1299.644063 hartree
zpe.sumelectthermalent: -1299.643119 hartree
zpe.sumelectthermalfe: -1299.687972 hartree
dipole: -0.0001 2.0600 -0.0006
dipole: 2.0600
quadrupole: -86.8858 -60.3066 -69.1194
quadrupole: -0.0004 -0.0014 0.0009
quadrupole: -14.7818 11.7973 2.9845 -0.0004 -0.0014 0.0009
hfenergy: -1299.7164741 hartree
pointgroup: C01 [X(C6H2Cl2O2)]
dipole: -0.0000553 0.810451 -0.0002516 debye
dipolederiv: -0.2474465 -0.2863518 -0.0000062 -0.418495 -0.4788731 0.0000168 -0.0000052 0.0000161 0.0246781 -0.2474888 0.2863657 0.0000453 0.4185057 -0.4788359 -0.0000471 0.0000355 -0.0000407 0.0246733 -0.8838841 0.1753099 -0.0001355 0.0528068 -0.4550709 -0.0000137 0.0000805 -0.0000477 -0.2932228 -0.8838484 -0.1753337 0.0002244 -0.0528372 -0.4550866 -0.0000233 -0.00012 -0.0000884 -0.293225 0.1080657 0.9077242 -0.0000301 1.0144877 0.1940305 -0.0000833 0.0001155 0.0000161 -0.0483808 0.1081612 -0.907733 -0.0000481 -1.0144871 0.1939129 0.0000896 -0.0000745 0.0002468 -0.048381 0.9911074 -0.3048547 0.0001818 -0.2708612 0.9220948 0.0000563 0.0000042 0.0000916 0.2572586 0.991033 0.3048606 -0.0001737 0.2708682 0.9221231 0.0000397 -0.0000475 0.0000585 0.2572559 -0.0296542 -0.2323531 -0.0001376 -0.2845687 -0.1675954 0.0000801 0.0000751 -0.000051 -0.1031253 -0.0296555 0.2323605 0.0000673 0.284573 -0.1675543 -0.0000083 -0.0000622 -0.000103 -0.1031187 0.0618031 0.0534449 0.0000114 0.015909 -0.0145713 -0.0000649 -0.0000169 -0.0000588 0.1627947 0.0618071 -0.0534395 0.000001 -0.0159012 -0.0145737 -0.0000421 0.0000155 -0.0000395 0.162793 unknown
polarizability: 138.4588187|0.0014661|99.142822|-0.0029708|0.0042082|32.4611757 unknown
InChI: InChI=1S/C6H2Cl2O2/c7-5-3(9)1-2-4(10)6(5)8/h1-2H
charge 0 multiplicity 1
12 atoms
Cl -1.64889 -2.235533 0.00015
Cl 1.648991 -2.235444 -0.000096
O  -2.735365 0.572931 0.000164
O  2.73529 0.573109 0.000276
C  -0.686642 -0.72966 0.000024
C  0.686653 -0.729618 -0.000069
C  -1.472263 0.557338 -0.000126
C  1.472184 0.557415 -0.000397
C  -0.681596 1.820746 0.000316
C  0.681441 1.82078 0.000171
H  -1.271272 2.743935 0.000688
H  1.271068 2.7440 0.0004
