program: Gaussian 09
title: 000138417
version: EM64L-G09RevD.01
frameworkgroup: C1[X(C13H13NO4)]
method: RPBEPBE
basis: SDD
operation: Freq
keyword: #p
keyword: freq=noraman
keyword: PBEPBE/SDD
title: #p freq=noraman PBEPBE/SDD
converged: YES YES NO NO
title: Mulliken charges:
elementType: O O O O N C C C C C C C C C C C C C H H H H H H H H H H H H H
charge: -0.198313 -0.187564 -0.409182 -0.216448 -0.274176 -0.102520 -0.042426 0.082293 0.098811 -0.719065 -0.731737 0.182818 0.207196 0.157630 -0.356122 -0.358100 -0.211151 -0.210973 0.275292 0.246637 0.234783 0.220758 0.220884 0.204230 0.214538 0.265138 0.270034 0.270673 0.239363 0.239321 0.387375
chargesum: 0.00000
title: Mulliken charges with hydrogens summed into heavy atoms:
elementType: O O O O N C C C C C C C C C C C C C
charge: -0.198313 -0.187564 -0.021807 -0.216448 -0.274176 0.172772 0.204212 0.082293 0.098811 -0.042639 -0.047831 0.182818 0.207196 0.157630 -0.086088 -0.087427 0.028212 0.028348
polarizability: 2.16005076e+02 6.02902819e-01 1.35152711e+02 1.96903469e+00 -2.45208361e+01 1.21212747e+02
1716.lowfreq: -4.9672 -3.1580 -0.0009 -0.0007 -0.0003 3.2048 17.0084 43.4534 54.1677
frequency: 16.7047 43.4412 54.1572 60.6296 105.4126 130.3268 141.9600 162.6798 185.1355 209.7949 237.5670 241.6713 284.5694 296.8681 332.3539 350.6473 362.4517 398.9193 422.9805 454.7227 456.1904 523.5608 526.9078 553.6525 598.2740 633.3292 659.2857 673.0603 684.6068 717.2869 735.1021 789.5397 796.8803 809.0483 871.9980 885.1826 906.9660 926.2264 946.5561 960.2178 974.2764 994.6896 1006.6369 1019.7585 1050.6435 1073.2031 1082.7171 1133.0555 1144.8280 1169.1996 1172.4037 1173.8230 1209.8466 1253.7694 1284.1349 1302.0753 1304.7339 1330.8818 1338.2765 1352.0618 1382.7899 1400.2152 1416.8485 1453.9755 1454.7749 1465.4797 1476.1767 1480.9915 1497.4091 1614.7938 1619.2163 1630.0104 1654.4860 1680.3840 2963.5014 2977.5931 2980.9400 3026.4694 3066.7539 3077.7496 3087.0539 3111.3761 3140.0139 3153.8528 3165.6499 3175.1642 3507.5158
redmass: 7.0180 5.4763 6.3980 2.7535 6.2611 7.0363 5.5520 4.5061 6.8528 1.0559 1.5016 2.6583 4.6921 3.9230 6.0189 6.7362 2.9975 3.2255 3.0419 3.9838 4.6151 7.1915 2.8113 6.1292 3.7556 2.1724 4.8115 3.3499 6.3586 2.8464 5.6917 5.1115 1.7219 3.9397 2.9703 5.0455 1.4089 1.2026 2.6621 1.6040 1.4154 2.8753 1.3495 2.0147 2.9442 2.5959 3.6533 2.0641 2.4193 1.2517 1.9441 1.7721 3.3137 1.3421 1.4944 2.0622 1.4389 1.6390 1.7137 2.8773 1.2023 1.2105 6.1573 2.8076 2.4790 1.0548 1.0477 1.0497 1.0466 7.7001 7.9511 11.6303 9.7193 12.1720 1.0801 1.0386 1.0380 1.0850 1.0985 1.0979 1.0993 1.0978 1.0865 1.0907 1.0956 1.1004 1.0639
irintensity: 1.3188 1.9573 1.9837 0.0281 1.8402 3.3076 0.2847 0.0078 0.8954 0.0237 0.0693 0.5066 3.7170 0.6287 6.5440 5.7247 1.2840 4.2243 4.7670 11.6373 1.9542 9.3203 14.9298 25.6451 57.6744 97.3390 0.1270 33.0165 3.7516 94.6331 10.9894 0.0354 27.0913 11.7344 1.6422 22.6701 0.0105 5.7390 13.7148 3.0138 1.7336 13.8380 0.0040 19.5327 129.6521 28.7369 140.1862 37.8453 6.7158 6.0375 8.9980 18.0849 27.4731 0.6907 0.1316 48.0509 4.2504 26.3404 26.6077 341.0073 10.7628 20.6256 10.0300 0.4143 11.7381 6.0250 4.2565 8.1861 24.8395 1.8674 77.8406 335.8877 229.9637 34.1261 16.9993 21.7213 30.3677 3.8204 4.7981 65.5275 38.9840 13.6393 1.8014 5.6125 5.5173 20.7311 34.8741
temp: 298.150 k
press: 1.00000 atm
elementType: 8 8 8 8 7 6 6 6 6 6 6 6 6 6 6 6 6 6 1 1 1 1 1 1 1 1 1 1 1 1 1
symmnumber: 1
zpe: 623129.2 jmol-1
zpe.correction: 0.237337 hartree
zpe.thermalcorrener: 0.253966 hartree
zpe.thermalcorrenthalpy: 0.254910 hartree
zpe.thermalcorrgfe: 0.191830 hartree
zpe.sumelectzpe: -857.565002 hartree
zpe.sumelectthermal: -857.548373 hartree
zpe.sumelectthermalent: -857.547429 hartree
zpe.sumelectthermalfe: -857.610509 hartree
dipole: -1.5891 0.5021 1.1646
dipole: 2.0332
quadrupole: -76.3043 -108.9137 -110.2452
quadrupole: -2.3213 -3.1601 2.9578
quadrupole: 22.1834 -10.4260 -11.7575 -2.3213 -3.1601 2.9578
hfenergy: -857.802339 hartree
pointgroup: C01 [X(C13H13N1O4)]
dipole: 0.6231099 -0.0020707 0.5015738 debye
polarizability: 216.0126634|-0.7595461|150.9196686|-1.4979735|11.5526837|105.4382025 unknown
InChI: InChI=1S/C13H13NO4/c1-7(2)10(13(17)18)14-11(15)8-5-3-4-6-9(8)12(14)16/h3-7,10,17H,1-2H3
charge 0 multiplicity 1
31 atoms
O  0.120762 -2.400293 -0.798706
O  -0.274868 2.050457 0.676061
O  -3.639859 1.043688 -1.236288
O  -1.543797 1.122329 -2.211516
N  -0.415406 -0.202804 -0.068546
C  -1.871694 -0.306082 -0.209487
C  -2.662202 -0.206182 1.143025
C  0.478037 -1.261485 -0.408516
C  0.276881 0.977612 0.328973
C  -1.848272 -0.823495 2.304979
C  -4.026456 -0.928529 1.019651
C  1.852141 -0.710187 -0.190116
C  1.731929 0.631666 0.248347
C  -2.291124 0.69066 -1.310633
C  3.105672 -1.315846 -0.360873
C  2.862269 1.412366 0.53081
C  4.255869 -0.533891 -0.078082
C  4.135812 0.809283 0.360818
H  -2.040688 -1.323924 -0.62523
H  -2.835521 0.863492 1.361348
H  -0.930217 -0.252334 2.525074
H  -1.563714 -1.869915 2.084156
H  -2.46441 -0.828598 3.222326
H  -3.877399 -2.012829 0.849009
H  -4.599467 -0.813288 1.957466
H  -4.632252 -0.520615 0.195618
H  3.185462 -2.352446 -0.702531
H  2.75816 2.448791 0.866398
H  5.252313 -0.971382 -0.201382
H  5.041524 1.38861 0.56967
H  -3.844783 1.673071 -1.980622
