program: Gaussian 09
title: 000011446
version: EM64L-G09RevD.01
frameworkgroup: C1[X(C5H9BrO2)]
method: RPBEPBE
basis: SDD
operation: Freq
keyword: #p
keyword: freq=noraman
keyword: PBEPBE/SDD
title: #p freq=noraman PBEPBE/SDD
converged: NO NO NO NO
title: Mulliken charges:
elementType: Br O O C C C C C H H H H H H H H H
charge: 0.018237 -0.399697 -0.209502 -0.303848 -0.359558 -0.562620 -0.684410 0.250020 0.226783 0.244932 0.225918 0.197699 0.318646 0.222097 0.220107 0.211188 0.384009
chargesum: 0.00000
title: Mulliken charges with hydrogens summed into heavy atoms:
elementType: Br O O C C C C C
charge: 0.018237 -0.015688 -0.209502 0.167866 0.064058 -0.243974 -0.031017 0.250020
polarizability: 9.45641532e+01 -7.22559818e+00 7.54002653e+01 -3.81268743e-01 -1.91575763e+00 5.93164980e+01
1716.lowfreq: -15.6334 -8.0445 -2.5306 -0.0007 -0.0006 -0.0002 49.2906 61.3883 88.5439
frequency: 49.1674 61.2375 88.5156 121.2525 142.8973 228.1064 250.9344 261.4588 314.4053 487.4516 517.5836 583.9784 637.7758 733.7457 742.4378 798.7888 891.1459 910.1239 1024.4289 1044.5715 1064.4174 1100.5558 1124.1296 1171.7952 1222.6657 1256.7414 1288.4332 1295.6701 1342.3444 1362.3147 1391.7752 1458.8553 1474.2318 1478.0217 1485.5196 1666.1200 2980.5399 2982.5411 3016.0135 3032.3169 3074.7220 3083.5087 3085.2348 3104.4204 3523.0866
redmass: 9.1680 1.8945 2.6886 4.0535 7.7945 1.2140 3.2155 4.8945 3.3907 3.5096 2.6046 3.5475 1.5990 3.2711 1.5242 2.1504 1.7210 1.5402 3.7244 2.1935 1.8825 1.8331 1.7518 1.4001 1.4325 1.4169 1.1581 1.2786 1.4432 1.8009 1.2048 1.0855 1.0570 1.0421 1.0771 8.8709 1.0562 1.0395 1.0603 1.0993 1.1011 1.0997 1.1007 1.0902 1.0642
irintensity: 2.1144 0.0359 0.1563 0.3235 0.6987 0.2090 2.4389 3.9153 0.8190 30.7843 14.5825 10.4333 192.4083 3.9897 10.4148 1.3304 2.4074 0.9873 178.1353 102.1532 7.4223 18.5673 26.5762 13.8875 2.1024 5.3333 2.6503 16.0382 3.2847 31.8177 8.4793 7.3934 3.5495 13.0906 15.7856 203.8474 36.3261 24.7960 16.0542 6.5944 4.5654 45.5589 52.7976 11.3941 33.9380
temp: 298.150 k
press: 1.00000 atm
elementType: 35 8 8 6 6 6 6 6 1 1 1 1 1 1 1 1 1
symmnumber: 1
zpe: 352635.1 jmol-1
zpe.correction: 0.134312 hartree
zpe.thermalcorrener: 0.144175 hartree
zpe.thermalcorrenthalpy: 0.145119 hartree
zpe.thermalcorrgfe: 0.097080 hartree
zpe.sumelectzpe: -359.198230 hartree
zpe.sumelectthermal: -359.188367 hartree
zpe.sumelectthermalent: -359.187423 hartree
zpe.sumelectthermalfe: -359.235462 hartree
dipole: -1.6227 0.5637 -1.5521
dipole: 2.3151
quadrupole: -56.8006 -52.3711 -61.8732
quadrupole: 3.6278 2.3396 -2.2813
quadrupole: 0.2144 4.6439 -4.8582 3.6278 2.3396 -2.2813
hfenergy: -359.3325417 hartree
pointgroup: C01 [X(C5H9Br1O2)]
dipole: 0.5153021 0.5026826 0.5580495 debye
dipolederiv: -0.3892503 -0.1697052 -0.0015267 -0.2479532 -0.4209399 0.029545 -0.0443688 -0.0101932 -0.1130254 -0.738467 0.2752619 0.4086876 0.2577355 -0.5855017 -0.3487054 0.3448067 -0.3014977 -0.6097002 -0.4823014 0.1955762 0.0412872 0.0311209 -0.5465021 0.2394726 0.2788326 0.1343282 -0.8234244 -0.1353337 -0.0866015 0.035668 -0.2125396 -0.0899373 -0.030204 -0.0646226 -0.0648285 0.0696672 -0.0203533 -0.0279853 0.0348833 0.1484641 0.1717924 -0.0183835 0.1535226 0.0294687 0.1598455 0.5564813 0.4280057 0.0507894 0.3796592 0.2627988 0.0885111 0.0380737 0.15438 0.0958862 -0.0290113 -0.0075872 0.0296403 -0.0916598 0.0353842 -0.0147443 -0.0210474 -0.0389248 0.0737462 0.7028134 -0.6651385 -0.4427002 -0.4159009 0.988729 -0.0718499 -0.5947646 -0.1044264 1.1424038 0.027118 0.064698 -0.0290014 0.0670631 -0.0759608 0.0489837 -0.0115337 0.0649955 0.0650521 0.0728429 -0.0252452 -0.017769 -0.0141205 0.0900616 -0.0059639 0.0073202 -0.0348673 -0.0850623 0.026797 0.0911316 -0.0250999 0.0705881 -0.1087765 0.0380914 -0.0184418 0.066709 0.0535891 0.0401211 -0.0091423 0.0322472 -0.0135094 0.0674264 -0.0131853 0.0002874 -0.0514435 -0.18826 0.0160371 -0.0481308 -0.0282957 -0.0408799 -0.0030394 -0.0624164 -0.0008839 -0.0140797 -0.0336595 -0.0980012 -0.130258 -0.0222048 -0.1409044 -0.0423827 -0.0462123 -0.0254968 -0.0472394 0.0843831 0.0711297 0.0050625 -0.0324819 0.0205429 0.0943861 -0.0255289 0.0346209 -0.0177798 -0.165023 0.0311102 0.0568563 -0.0054158 0.1272067 -0.1029276 0.0772311 -0.028653 0.0907363 0.0510035 0.3482675 0.0532016 -0.0287074 0.0750871 0.2653897 0.1153591 -0.0476515 0.1446628 0.222578 unknown
polarizability: 85.6595102|11.862094|84.188254|-3.0532942|-0.4991934|59.4331523 unknown
InChI: InChI=1S/C5H9BrO2/c1-2-3-4(6)5(7)8/h4,7H,2-3H2,1H3
charge 0 multiplicity 1
17 atoms
Br -1.639349 -2.126716 0.165178
O  -2.05079 1.249398 0.819404
O  -0.994393 1.129159 -1.249914
C  0.963183 -0.741311 -0.059802
C  1.948742 0.39521 0.323605
C  -0.429693 -0.503384 0.522355
C  3.36435 0.126751 -0.230491
C  -1.156104 0.682535 -0.096627
H  1.34905 -1.705953 0.316469
H  0.888737 -0.813792 -1.159702
H  1.575735 1.358768 -0.072982
H  1.993785 0.493704 1.426736
H  -0.438604 -0.421991 1.619613
H  4.057975 0.942523 0.040433
H  3.34819 0.048049 -1.332699
H  3.778072 -0.816966 0.170526
H  -2.544687 1.995215 0.382799
