program: Gaussian 09
title: 000138415
version: EM64L-G09RevD.01
frameworkgroup: C1[X(C8H6O)]
method: RPBEPBE
basis: SDD
operation: Freq
keyword: #p
keyword: freq=noraman
keyword: PBEPBE/SDD
title: #p freq=noraman PBEPBE/SDD
converged: NO NO NO NO
title: Mulliken charges:
elementType: O C C C C C C C C H H H H H H
charge: -0.408895 0.167689 0.156166 -0.349061 -0.384586 -0.243650 -0.202927 0.169581 -0.473308 0.251553 0.220336 0.229847 0.232353 0.356483 0.278419
chargesum: 0.00000
title: Mulliken charges with hydrogens summed into heavy atoms:
elementType: O C C C C C C C C
charge: -0.052412 0.167689 0.156166 -0.097508 -0.164250 -0.011297 0.026920 0.169581 -0.194888
polarizability: 1.41494702e+02 4.27674352e+00 9.03883913e+01 2.56397933e-03 -4.67279049e-04 3.45571065e+01
1716.lowfreq: -10.9973 0.0006 0.0008 0.0011 13.5226 16.0381 128.9870 136.7529 226.7236
frequency: 128.9658 136.7442 226.7077 350.1096 364.3601 375.5168 445.0288 481.3142 536.4447 566.9339 573.4323 612.8783 650.0693 716.3118 736.5335 757.6600 824.6110 850.3510 939.0793 976.6857 1035.1962 1074.3206 1154.6431 1172.9441 1207.6563 1255.5558 1288.5173 1384.2107 1431.6105 1490.9054 1589.0590 1606.6195 2129.8351 3111.0973 3139.3488 3151.6321 3171.5034 3426.3027 3577.9305
redmass: 4.3208 4.3663 4.4499 5.2604 1.1421 3.6745 8.1591 3.5040 5.4164 4.0946 7.4650 1.2415 1.2388 5.4652 3.8442 1.2690 6.3940 1.4413 1.3740 1.3233 2.2399 2.3447 1.2334 1.0613 2.9595 2.6145 1.4794 6.3420 2.4265 2.6087 6.2055 6.6000 6.2793 1.0889 1.0874 1.0939 1.1005 1.1557 1.0659
irintensity: 3.4974 2.8963 6.5413 3.2322 123.9807 11.5614 0.8699 8.6649 7.0834 0.0164 5.9874 72.0310 63.4529 3.2562 1.4413 112.7497 28.8344 0.0720 3.5001 0.0405 5.5856 99.8753 56.6609 1.5949 36.7178 24.0499 42.7571 9.5197 43.4159 34.2255 20.2623 9.2801 5.3211 13.3949 2.6525 17.8831 18.3813 82.1031 34.6978
temp: 298.150 k
press: 1.00000 atm
elementType: 8 6 6 6 6 6 6 6 6 1 1 1 1 1 1
symmnumber: 1
zpe: 290983.4 jmol-1
zpe.correction: 0.110830 hartree
zpe.thermalcorrener: 0.118604 hartree
zpe.thermalcorrenthalpy: 0.119548 hartree
zpe.thermalcorrgfe: 0.078831 hartree
zpe.sumelectzpe: -382.981834 hartree
zpe.sumelectthermal: -382.974060 hartree
zpe.sumelectthermalent: -382.973116 hartree
zpe.sumelectthermalfe: -383.013833 hartree
dipole: 2.0602 1.0147 0.0003
dipole: 2.2965
quadrupole: -44.7678 -41.4118 -56.5711
quadrupole: 3.5406 -0.0013 -0.0006
quadrupole: 2.8157 6.1718 -8.9875 3.5406 -0.0013 -0.0006
hfenergy: -383.0926634 hartree
pointgroup: C01 [X(C8H6O1)]
dipole: -0.8222756 -0.3744712 0.0001036 debye
dipolederiv: -0.273024 0.6255953 0.000011 0.4228365 -1.0635763 -0.0000057 0.00001 -0.0000064 -0.3962816 0.2690169 -0.0666147 0.0000021 0.2664623 -0.152609 -0.0000069 0.0000157 -0.0000006 -0.0032087 0.189325 -0.6015793 -0.0000094 -0.3899078 1.0283789 0.000011 -0.0000048 0.0000228 0.0680087 0.1135967 0.0535887 -0.000012 -0.0977287 0.0988244 0.0000083 -0.0000055 0.0000036 -0.1346022 -0.1194661 0.3723835 -0.0000014 0.0292189 -0.1012338 -0.0000006 -0.0000073 -0.0000035 -0.1994938 -0.2088823 -0.1264876 -0.0000004 -0.183838 -0.0646176 0.0000087 -0.0000049 0.0000022 -0.1890493 0.0398378 -0.0511417 0.0000033 0.1516938 0.1780544 -0.0000032 0.0000142 0.0000051 -0.13504 0.2381825 0.0994836 -0.0000337 0.0312439 -0.0658099 -0.0000031 -0.0001244 -0.0000156 0.0208606 -0.6174677 -0.0675777 0.0000537 -0.0751788 -0.2940997 0.0000062 0.0002029 0.000027 -0.3426252 0.0590161 -0.0794528 0.0000025 -0.0619855 -0.0363597 -0.0000016 0.0000031 -0.0000027 0.1551703 0.048823 -0.0416382 0.0000018 -0.0826603 -0.1166807 -0.0000021 0.0000007 -0.0000046 0.174898 -0.1221364 -0.0109164 0.0000041 -0.0175023 0.088873 -0.0000008 -0.0000016 -0.0000016 0.1601788 0.0066055 0.0870315 0.000004 0.1030252 -0.0510589 -0.0000044 0.0000031 -0.0000026 0.1734844 0.1406971 -0.1924707 -0.0000068 -0.1022485 0.2984258 -0.0000039 0. -0.0000098 0.3820136 0.235876 -0.0002034 -0.0000189 0.0065693 0.253489 -0.0000017 -0.0001011 -0.0000134 0.2656863 unknown
polarizability: 141.7067565|2.7218064|90.1763365|-0.0025487|0.0005447|34.5571065 unknown
InChI: InChI=1S/C8H6O/c1-2-7-5-3-4-6-8(7)9/h1,3-6,9H
charge 0 multiplicity 1
15 atoms
O  0.638889 -2.107508 -0.000073
C  0.475833 0.294227 -0.000062
C  -0.180629 -0.974332 -0.000042
C  -0.331041 1.467188 -0.00002
C  -1.593181 -1.056951 -0.000005
C  -1.738391 1.389044 0.000022
C  -2.369358 0.121461 0.000028
C  1.906393 0.388405 -0.000083
C  3.136724 0.503595 -0.00007
H  0.172185 2.439753 -0.000019
H  -2.083103 -2.040045 -0.00001
H  -3.462289 0.04742 0.000039
H  -2.337758 2.305019 0.000042
H  0.092701 -2.932879 -0.000104
H  4.208425 0.583305 0.000156
