program: Gaussian 09
title: 000138413
version: EM64L-G09RevD.01
frameworkgroup: C1[X(C13H11N)]
method: RPBEPBE
basis: SDD
operation: Freq
keyword: #pfreq=noraman
keyword: PBEPBE/SDD
title: #p freq=noraman PBEPBE/SDD
converged: YES YES NO NO
title: Mulliken charges:
elementType: N C C C C C C C C C C C C C H H H H H H H H H H H
charge: 0.002620 0.490932 0.458331 -0.318525 -0.305876 -0.388848 -0.398809 -0.322003 -0.234661 -0.236597 -0.480464 -0.242202 -0.189750 -0.351178 0.218644 0.209879 0.222599 0.228992 0.235676 0.226550 0.228806 0.241070 0.231310 0.230567 0.242938
chargesum: 0.00000
title: Mulliken charges with hydrogens summed into heavy atoms:
elementType: N C C C C C C C C C C C C C
charge: 0.002620 0.490932 0.458331 -0.099881 -0.095997 -0.166249 -0.169818 -0.086327 -0.008112 -0.007791 -0.239394 -0.010892 0.040818 -0.108240
polarizability: 3.18177275e+02 -8.59678261e+00 1.41322519e+02 -1.87026188e-02 -1.43630674e-02 5.60941193e+01
1716.lowfreq: -8.2759 -0.0009 -0.0008 -0.0006 0.5095 10.4188 22.7783 58.3206 76.5687
frequency: 22.7002 58.3195 76.5679 88.9085 196.5391 225.8123 269.2607 283.6719 393.3155 402.4459 460.1201 461.1368 535.3033 544.6871 611.7539 615.7440 650.7289 694.3543 713.3059 763.6726 811.3360 816.7511 844.3582 859.9061 884.1701 912.2074 922.7724 937.7804 976.2884 979.0679 987.5022 987.7422 998.7596 999.1654 1025.5520 1030.5607 1084.4098 1116.7036 1173.2791 1191.9669 1195.2485 1206.8310 1241.3472 1290.7439 1307.2318 1322.0906 1342.1044 1349.5833 1387.2787 1417.0092 1440.7238 1459.8287 1487.0322 1544.5731 1579.2315 1582.2627 1610.0835 1647.4943 3087.1919 3101.0053 3119.7045 3123.8670 3125.9381 3127.6448 3136.7963 3139.1689 3149.3633 3165.1037 3166.0761
redmass: 3.9011 4.9775 4.6766 3.0329 6.0081 2.2301 3.6720 5.0416 2.9938 2.7769 4.2382 3.2965 3.5109 6.8548 7.6446 6.4857 6.0281 1.7185 1.8095 1.6629 1.7356 5.9623 1.2806 4.3714 1.7569 1.3950 1.5052 1.6136 1.3503 1.2869 6.0614 1.3112 1.2879 3.7729 2.2911 2.8559 1.6289 1.6250 1.0646 1.1170 1.7391 1.7973 1.4626 2.7470 1.7079 2.8669 1.3653 1.2341 6.1131 2.1004 2.2363 2.1588 2.3628 5.0105 5.5780 5.6226 5.9207 5.3316 1.0915 1.0867 1.0869 1.0881 1.0860 1.0903 1.0910 1.0911 1.0962 1.1000 1.1015
irintensity: 1.1967 0.1280 0.1343 0.0014 0.1787 0.3088 0.0005 0.6315 1.9525 0.0743 2.0863 2.8509 11.2300 13.9389 3.2643 0.2916 0.0035 44.9953 50.2948 25.0982 54.4965 0.1824 0.7090 0.4485 2.5554 0.6712 0.1507 0.0993 5.1039 24.0534 0.1152 20.4094 14.2622 5.8988 3.6250 1.7840 9.6574 7.0814 0.3719 1.1531 2.7965 0.5675 9.6566 5.5352 0.2183 2.1301 3.2233 2.1870 4.9989 6.7537 8.1348 21.3389 25.6862 4.9232 9.8651 2.5876 4.3615 13.5014 5.8179 35.3694 10.5671 10.0849 0.7400 16.7769 12.7920 5.5544 42.7560 43.4087 26.3288
temp: 298.150 k
press: 1.00000 atm
elementType: 7 6 6 6 6 6 6 6 6 6 6 6 6 6 1 1 1 1 1 1 1 1 1 1 1
symmnumber: 1
zpe: 523134.1 jmol-1
zpe.correction: 0.199251 hartree
zpe.thermalcorrener: 0.210611 hartree
zpe.thermalcorrenthalpy: 0.211555 hartree
zpe.thermalcorrgfe: 0.160023 hartree
zpe.sumelectzpe: -555.755242 hartree
zpe.sumelectthermal: -555.743882 hartree
zpe.sumelectthermalent: -555.742938 hartree
zpe.sumelectthermalfe: -555.794470 hartree
dipole: 1.6978 2.3538 0.0076
dipole: 2.9023
quadrupole: -74.0933 -74.8812 -89.1822
quadrupole: -10.9659 -0.0428 -0.0220
quadrupole: 5.2923 4.5043 -9.7966 -10.9659 -0.0428 -0.0220
hfenergy: -555.954493 hartree
pointgroup: C01 [X(C13H11N1)]
dipole: -0.6639099 -0.928019 -0.0423638 debye
dipolederiv: -0.362388 -0.0298196 -0.0024147 0.0331991 -0.3056172 -0.0019474 -0.0002998 -0.0026728 -0.2433418 0.2163786 -0.02471 0.0008822 -0.0448918 -0.0491714 -0.0048519 -0.0007451 -0.0044886 0.0521676 0.6028775 -0.0540029 0.0042073 0.0940587 -0.2143471 -0.0105006 0.0091759 -0.0124023 0.0935814 0.2945046 0.0187617 0.0062728 0.1208167 0.1268309 0.0132265 0.0110877 0.0117924 -0.1512859 -0.2491479 0.0482077 0.0009075 0.3004016 0.1258791 0.0160659 0.0128699 0.0126931 -0.171472 -0.1269547 -0.0591494 -0.0021629 -0.0368302 0.0054685 0.0062839 -0.0010058 0.0059349 -0.1519705 -0.1590314 0.0832397 0.0039341 -0.004566 0.0703915 0.0106974 0.0003828 0.0116437 -0.1792607 -0.1636857 0.0369133 0.0013568 0.0712946 0.1373357 0.0116301 0.0019143 0.0113204 -0.15316 -0.0939459 0.0667833 0.0035721 0.196886 0.1195678 0.0138146 0.009262 0.0122089 -0.1458494 0.0626454 -0.1088429 -0.0021455 -0.2030958 0.0608055 0.006325 -0.0063321 0.0075871 -0.1439506 -0.0540027 0.0276305 0.0013272 -0.2195374 0.2360691 0.0085806 -0.0078859 0.0119697 -0.0718518 -0.0457657 0.0268497 0.0029101 -0.0496672 -0.0560152 0.0042614 -0.000379 0.0051885 -0.1687829 -0.0167215 -0.0913899 -0.0020441 -0.2848071 -0.0161925 -0.00058 -0.0080087 0.0016233 -0.1034075 0.155231 -0.0032889 0.0027494 0.0901129 0.1055048 0.008819 0.005923 0.0075246 -0.0994048 0.0474929 -0.0271006 -0.00233 -0.1078949 -0.0851019 -0.0110584 -0.0058531 -0.0099873 0.1450628 0.0314094 -0.0280243 -0.002639 -0.1127632 -0.0995283 -0.0114531 -0.0063804 -0.0102668 0.143972 0.028341 0.114448 0.0034019 0.0834337 -0.0253814 -0.0061966 0.0019829 -0.0057798 0.1441754 0.0623048 -0.0993998 -0.0053988 -0.0637045 -0.0726385 -0.0105638 -0.0038287 -0.0109201 0.1542182 0.0736336 -0.0957875 -0.0045387 -0.0629428 -0.0656837 -0.0085708 -0.0035757 -0.00904 0.1454974 0.0297191 -0.0650679 -0.004411 -0.1129048 -0.0953514 -0.0122249 -0.0064832 -0.011599 0.156577 -0.0254277 0.0998142 0.0019896 0.1342513 -0.0444804 -0.0071138 0.0034629 -0.0075648 0.159137 0.0011746 0.1025295 0.0022844 0.1059934 -0.0033673 -0.0032367 0.0023018 -0.0032793 0.119364 -0.1402168 -0.028439 -0.0051294 -0.0344621 0.0861796 -0.0037991 -0.0054036 -0.0037323 0.164028 -0.028608 0.098077 0.0011545 0.1406795 -0.0248131 -0.0049465 0.0025892 -0.0053044 0.1601775 -0.1398166 -0.0082321 -0.0037359 -0.0330597 0.083657 -0.0026609 -0.0047713 -0.002449 0.1457796 unknown
polarizability: 318.2096507|-7.9451388|141.1202847|2.899256|3.3301429|56.2639776 unknown
InChI: InChI=1S/C13H11N/c1-2-5-12(6-3-1)8-9-13-7-4-10-14-11-13/h1-11H
charge 0 multiplicity 1
25 atoms
N  3.858077 1.373683 0.130397
C  -1.939279 0.175719 0.017023
C  1.961236 -0.202894 0.048253
C  -0.492811 0.446871 0.046034
C  0.517787 -0.478703 0.019316
C  -2.493872 -1.137338 -0.046008
C  -2.840239 1.279616 0.053126
C  2.886485 -1.286114 0.019889
C  -3.888338 -1.331621 -0.072174
C  -4.236974 1.085744 0.027162
C  2.523412 1.110098 0.104361
C  -4.769384 -0.222451 -0.035926
C  4.272757 -1.032643 0.046845
C  4.716889 0.308126 0.101354
H  -0.228237 1.51284 0.09383
H  0.256151 -1.5460 -0.028066
H  -1.833518 -2.011126 -0.074892
H  -2.434024 2.297797 0.101836
H  2.512221 -2.316347 -0.022883
H  -4.294235 -2.348409 -0.120858
H  -4.90851 1.950951 0.056043
H  1.876459 1.994617 0.129426
H  -5.853578 -0.377998 -0.05661
H  4.997587 -1.852624 0.026685
H  5.784637 0.552904 0.123136
