program: Gaussian 09
title: 000138412
version: EM64L-G09RevD.01
frameworkgroup: C1[X(C8H14O)]
method: RPBEPBE
basis: SDD
operation: Freq
keyword: #pfreq=noraman
keyword: PBEPBE/SDD
title: #p freq=noraman PBEPBE/SDD
converged: YES YES NO NO
title: Mulliken charges:
elementType: O C C C C C C C C H H H H H H H H H H H H H H
charge: -0.235886 -0.142605 -0.361948 -0.706769 -0.081648 -0.690376 -0.330697 0.191074 -0.781757 0.204622 0.199682 0.202089 0.216748 0.227983 0.213984 0.271528 0.230187 0.205514 0.216979 0.229989 0.233826 0.233547 0.253933
chargesum: 0.00000
title: Mulliken charges with hydrogens summed into heavy atoms:
elementType: O C C C C C C C C
charge: -0.235886 0.062017 0.039823 -0.048055 0.189880 -0.037695 -0.100708 0.191074 -0.060451
polarizability: 1.22309431e+02 6.06938187e+00 7.60543568e+01 -3.05970992e+00 -3.08116618e+00 8.11285767e+01
1716.lowfreq: -8.7453 -3.0716 -0.0004 0.0006 0.0007 3.6296 35.1467 67.3781 100.4603
frequency: 35.0321 67.3638 100.4517 104.6034 123.8640 140.3983 207.5109 215.3455 227.7703 312.6377 341.7068 380.3451 436.6971 485.4205 577.9100 587.4396 769.2120 811.3320 863.4779 891.4496 909.8905 955.9739 973.3569 1003.1367 1016.3050 1026.4969 1031.1383 1090.5760 1140.3440 1159.5062 1196.3776 1239.0095 1275.3171 1281.6377 1294.7561 1326.0873 1349.9825 1367.3567 1382.4459 1390.2863 1442.8282 1455.7939 1463.7367 1472.9038 1475.3900 1477.7536 1483.7392 1583.5158 1655.6849 2968.5416 2975.7816 2977.2594 2977.8699 2978.7803 3024.3975 3060.0374 3069.5097 3070.3438 3074.4286 3079.7635 3082.8297 3105.8770 3124.2682
redmass: 3.2479 3.1621 1.1198 1.7511 3.5077 2.8070 1.2129 1.4590 1.5055 2.6909 3.0443 2.7136 2.4561 2.6948 2.6308 3.9311 1.2642 2.0507 1.7731 2.9323 1.6603 1.4773 1.3192 1.1511 1.5267 1.9646 2.6920 2.6064 1.9104 1.8489 1.9588 1.5162 1.3867 1.2158 1.4143 1.4340 1.5611 1.2754 1.2008 1.2134 1.0862 1.0501 1.0676 1.0484 1.0415 1.0615 1.0570 7.5659 6.2436 1.0621 1.0358 1.0377 1.0376 1.0791 1.1012 1.0963 1.0928 1.0997 1.0964 1.0999 1.1000 1.0910 1.0994
irintensity: 4.2886 0.6448 0.2451 0.4519 2.5177 0.2483 0.0250 0.1650 0.3937 1.2681 3.4602 1.0988 1.8760 3.4271 0.9129 15.2039 11.1710 0.7222 3.2275 0.1761 28.4711 20.0007 1.6850 49.8236 7.5201 4.2982 7.7999 4.2086 1.7743 23.2342 35.4751 43.6868 24.6869 2.9969 1.1973 1.3734 54.3713 80.6959 7.2104 15.7128 27.8616 18.6868 3.3601 9.0069 17.7818 2.8600 6.7182 168.9305 106.1612 18.8152 53.0652 11.2085 2.7031 36.6569 20.3123 15.1646 10.8036 16.7910 58.0398 52.0080 41.7638 16.7724 18.8203
temp: 298.150 k
press: 1.00000 atm
elementType: 8 6 6 6 6 6 6 6 6 1 1 1 1 1 1 1 1 1 1 1 1 1 1
symmnumber: 1
zpe: 521398.3 jmol-1
zpe.correction: 0.198590 hartree
zpe.thermalcorrener: 0.210234 hartree
zpe.thermalcorrenthalpy: 0.211178 hartree
zpe.thermalcorrgfe: 0.160438 hartree
zpe.sumelectzpe: -387.732482 hartree
zpe.sumelectthermal: -387.720838 hartree
zpe.sumelectthermalent: -387.719894 hartree
zpe.sumelectthermalfe: -387.770634 hartree
dipole: -1.9797 0.3431 -2.8619
dipole: 3.4968
quadrupole: -55.6072 -56.7612 -58.5848
quadrupole: 2.1541 -7.9741 0.3307
quadrupole: 1.3772 0.2232 -1.6004 2.1541 -7.9741 0.3307
hfenergy: -387.9310717 hartree
pointgroup: C01 [X(C8H14O1)]
dipole: -0.7901758 -0.0528948 1.1249308 debye
dipolederiv: -0.7426315 0.0481149 0.0453952 0.0146926 -0.328772 0.0644928 0.3650229 0.0274496 -0.8296229 -0.1288528 0.0166005 -0.0044361 0.0604961 -0.0009285 -0.0159015 -0.1510629 0.0220052 0.1462683 0.1161792 0.0172374 -0.0279151 0.1079534 0.0791565 0.003491 0.1157687 0.000127 0.15036 -0.0403795 0.0346386 -0.0095311 -0.0876182 -0.0071657 0.0156467 0.1014109 -0.0346998 0.0940736 0.6055165 -0.0955458 -0.0013357 -0.1588484 -0.1512499 -0.0356837 0.125259 -0.0686474 0.0913256 0.0246385 -0.0114603 -0.0105645 0.0104791 -0.0816885 0.0147646 -0.0330773 -0.0003868 0.0803326 -1.1555114 0.1183118 0.0199823 0.1585362 -0.2273541 -0.0401822 -0.1310886 -0.0147172 0.0560348 1.6736216 -0.2190075 0.1023826 -0.2012997 0.2035972 -0.1148106 -0.2845108 -0.0685315 0.8656986 -0.3520473 0.0894572 -0.2370136 0.1110629 0.0166784 0.0774273 -0.3366745 0.0908604 -0.2450318 0.0142092 0.0030474 -0.0391441 0.004823 0.0246063 0.0588576 0.017547 0.0300514 -0.1698942 0.0881085 -0.0138272 0.0263506 -0.0070092 0.014453 0.0608289 -0.0299911 0.0340749 -0.1721346 -0.2149777 0.0550888 0.0409474 0.0233659 0.0110363 -0.0235564 0.0611498 -0.0227991 0.054854 -0.1763145 0.0722636 0.0799833 0.0699825 0.0550255 0.0108547 0.0803951 0.0007259 0.0607509 0.0290684 -0.123284 -0.0679581 -0.0813954 -0.0754685 -0.0537698 -0.0605234 -0.0789014 0.0482338 0.101546 0.0125829 0.0120075 0.0006053 0.0674005 -0.0074142 -0.0262109 0.0721461 -0.1514758 0.0764575 0.0111709 0.0027378 0.0151826 0.1343587 0.0203207 0.0105524 0.0236243 -0.0453983 -0.1024311 0.0953005 0.0656626 0.0756304 0.0676122 0.0066622 0.0723555 -0.0028073 0.055644 0.0891861 0.0188109 -0.0035369 0.0152903 0.0609336 -0.0007248 0.018952 0.0673044 -0.1741939 -0.0280851 -0.1345971 -0.0696194 -0.1293715 -0.0754818 -0.0570329 -0.0821314 -0.0766474 0.0562086 0.0587154 0.0144732 0.0279352 0.0172957 0.1485581 0.034185 0.0288505 0.0323311 -0.1094375 0.0814051 0.0356882 -0.0116191 -0.011866 -0.0059523 -0.1202497 -0.0047685 -0.1080896 0.0166394 0.0638124 -0.0690498 0.0112626 -0.0249284 -0.0456565 0.0998957 0.0272244 0.0841039 0.0735313 -0.0812334 0.0239848 0.0480263 0.0169408 0.1163014 0.0018987 0.1155512 -0.0085767 0.0472337 unknown
polarizability: 122.0685722|-6.4924336|75.8617014|3.7733461|-2.8465102|81.5620905 unknown
InChI: InChI=1S/C8H14O/c1-4-7(2)5-6-8(3)9/h5-7H,4H2,1-3H3
charge 0 multiplicity 1
23 atoms
O  2.402017 0.084664 -1.360581
C  -1.637921 0.50349 0.349178
C  -2.601135 -0.55268 -0.276535
C  -2.15321 1.941824 0.06249
C  -0.238743 0.3446 -0.196257
C  -2.260608 -2.009412 0.101769
C  0.884189 0.06697 0.526862
C  2.228365 -0.059685 -0.113021
C  3.393177 -0.375776 0.820174
H  -1.61968 0.345391 1.447155
H  -2.589406 -0.43738 -1.379658
H  -3.631836 -0.31283 0.053302
H  -3.173173 2.072968 0.469101
H  -1.496596 2.703409 0.51917
H  -2.193538 2.135391 -1.026061
H  -0.113417 0.472889 -1.284869
H  -1.247921 -2.287714 -0.241881
H  -2.294188 -2.152735 1.198544
H  -2.979726 -2.715154 -0.352522
H  0.827929 -0.072397 1.615598
H  3.495041 0.41206 1.591219
H  3.212474 -1.328294 1.354466
H  4.329805 -0.449499 0.246955
