program: Gaussian 09
title: 000138409
version: EM64L-G09RevD.01
frameworkgroup: C1[X(C11H12N2O2)]
method: RPBEPBE
basis: SDD
operation: Freq
keyword: #p
keyword: freq=noraman
keyword: PBEPBE/SDD
title: #p freq=noraman PBEPBE/SDD
converged: YES YES NO NO
title: Mulliken charges:
elementType: O O N N C C C C C C C C C C C H H H H H H H H H H H H
charge: -0.265421 -0.261575 -0.366031 -0.347344 -0.141507 -0.595315 0.175838 0.469892 -0.458073 0.159803 -0.428845 -0.396988 -0.228287 -0.226602 -0.236099 0.265403 0.228342 0.264558 0.351980 0.257266 0.261882 0.334932 0.249976 0.239547 0.231235 0.228805 0.232631
chargesum: 0.00000
title: Mulliken charges with hydrogens summed into heavy atoms:
elementType: O O N N C C C C C C C C C C C
charge: -0.265421 -0.261575 -0.014052 -0.012412 0.123896 -0.102415 0.175838 0.469892 0.061075 0.159803 -0.178869 -0.157441 0.002948 0.002203 -0.003469
polarizability: 1.68086000e+02 -4.66775115e+00 1.33544435e+02 1.03436280e+01 1.12588606e+01 9.34076333e+01
1716.lowfreq: -21.4291 -7.7044 -5.8057 -0.0008 -0.0008 -0.0007 23.8171 36.5587 47.9003
frequency: 21.0372 35.9971 47.8045 72.1846 109.0003 144.5351 186.6570 226.2935 327.1421 371.6461 404.0832 413.2239 424.1442 450.5118 490.7682 519.8105 555.4613 588.6101 608.5217 616.6657 687.0181 705.7855 723.0070 742.5978 760.7908 772.1728 826.6468 858.2176 896.9693 927.8181 931.5812 979.4988 986.5368 989.8093 998.1252 1020.4868 1026.6298 1060.2086 1084.7687 1121.1702 1173.9474 1188.3004 1196.8418 1213.7477 1219.9844 1249.1134 1288.5776 1299.5236 1313.4588 1332.7596 1355.2367 1380.9008 1404.0303 1417.7439 1430.5273 1439.4941 1470.5665 1477.6403 1483.9419 1591.0279 1612.8255 1631.3739 1638.2088 2939.0045 2972.9358 3014.9912 3060.3676 3080.9623 3115.5183 3117.3396 3134.3585 3146.8420 3164.9732 3479.7142 3514.4587
redmass: 3.9490 4.6488 4.0258 4.8174 6.9875 3.1494 6.2280 5.7431 3.2473 3.4741 2.8484 4.7127 4.1734 7.0750 3.8576 2.5411 4.1124 4.3651 2.5360 6.1829 1.6939 1.7883 1.4705 2.4813 2.5244 4.0790 4.2737 1.2471 2.4409 2.2832 1.6498 1.3891 1.9767 6.1220 1.3164 2.5569 2.1605 3.2625 1.7099 1.8282 1.0554 1.1161 1.3996 2.4329 1.0955 1.3004 1.7780 1.7224 1.4896 1.2691 1.8488 7.3294 3.9353 1.5594 1.8949 2.1389 1.1419 1.2689 2.2006 5.9585 6.0941 5.7362 6.2861 1.0817 1.0672 1.0607 1.0942 1.1025 1.0882 1.0874 1.0902 1.0955 1.1014 1.0760 1.0762
irintensity: 1.5865 1.3448 4.2486 0.7455 3.6075 0.4260 3.6696 1.4259 1.0507 15.0085 0.4633 17.6503 1.2525 1.1724 10.4665 6.2256 12.9560 2.5926 39.4318 0.7289 46.7756 85.0938 126.8946 18.9099 18.4846 11.5656 10.2129 0.4360 7.7161 0.6675 12.4731 0.2410 2.1171 0.4985 0.3112 10.5021 13.5058 47.6344 10.0968 11.7740 0.1204 0.4320 11.3429 3.0345 1.5012 44.5372 13.3073 134.5053 5.1264 2.3908 2.6379 0.4515 175.2135 18.2399 1.7376 7.2764 11.7383 16.9379 15.2669 2.9044 8.4591 253.7026 425.5732 19.3015 31.9579 11.7785 8.0946 9.4706 5.8705 9.7125 7.1043 33.8331 21.2752 61.1641 21.6223
temp: 298.150 k
press: 1.00000 atm
elementType: 8 8 7 7 6 6 6 6 6 6 6 6 6 6 6 1 1 1 1 1 1 1 1 1 1 1 1
symmnumber: 1
zpe: 563831.0 jmol-1
zpe.correction: 0.214752 hartree
zpe.thermalcorrener: 0.227830 hartree
zpe.thermalcorrenthalpy: 0.228774 hartree
zpe.thermalcorrgfe: 0.172661 hartree
zpe.sumelectzpe: -685.260997 hartree
zpe.sumelectthermal: -685.247919 hartree
zpe.sumelectthermalent: -685.246975 hartree
zpe.sumelectthermalfe: -685.303088 hartree
dipole: -0.4967 -0.4218 -0.7703
dipole: 1.0090
quadrupole: -70.1893 -110.6700 -84.3667
quadrupole: -4.0076 1.0489 5.6198
quadrupole: 18.2194 -22.2613 4.0419 -4.0076 1.0489 5.6198
hfenergy: -685.4757491 hartree
pointgroup: C01 [X(C11H12N2O2)]
dipole: -0.1805873 0.2269908 0.2710192 debye
polarizability: 166.3918335|2.5889021|136.462659|-15.8081165|1.3742677|92.183575 unknown
InChI: InChI=1S/C11H12N2O2/c14-10-7-12-11(15)9(13-10)6-8-4-2-1-3-5-8/h1-5,9,12-13H,6-7H2
charge 0 multiplicity 1
27 atoms
O  2.084955 2.474036 -1.090414
O  2.22263 -2.762501 0.563934
N  1.004357 -0.831734 0.11846
N  3.300111 0.596041 -0.481988
C  0.843399 0.620676 -0.086048
C  -0.341321 0.908684 -1.058052
C  2.124345 1.305379 -0.599758
C  -1.668749 0.413638 -0.504236
C  3.47309 -0.712971 0.167717
C  2.179744 -1.5254 0.296002
C  -2.22688 -0.818436 -0.934674
C  -2.361771 1.162855 0.483602
C  -3.443606 -1.293143 -0.391003
C  -3.576718 0.692619 1.028087
C  -4.120627 -0.539889 0.594345
H  0.601937 1.110568 0.883369
H  -0.116381 0.429345 -2.028375
H  -0.351549 2.000296 -1.221733
H  0.140174 -1.375177 0.228422
H  3.898577 -0.604826 1.186762
H  4.179149 -1.33236 -0.412229
H  4.136154 1.085252 -0.815812
H  -1.717233 -1.398835 -1.71434
H  -1.953094 2.126029 0.81518
H  -3.861435 -2.244658 -0.73817
H  -4.102064 1.286721 1.784279
H  -5.063994 -0.904313 1.015673
