program: Gaussian 09
title: 000138406
version: EM64L-G09RevD.01
frameworkgroup: C1[X(C9H13NO4)]
method: RPBEPBE
basis: SDD
operation: Freq
keyword: #p
keyword: freq=noraman
keyword: PBEPBE/SDD
title: #p freq=noraman PBEPBE/SDD
converged: YES YES NO NO
title: Mulliken charges:
elementType: O O O O N C C C C C C C C C H H H H H H H H H H H H H
charge: -0.237665 -0.263896 -0.283556 -0.435863 -0.047955 0.294542 0.063032 0.116071 -0.456096 0.033119 -0.400119 -0.534453 -0.520077 -0.507502 0.284356 0.239470 0.217709 0.232563 0.258216 0.211620 0.249687 0.221366 0.228914 0.237847 0.233505 0.226616 0.338550
chargesum: 0.00000
title: Mulliken charges with hydrogens summed into heavy atoms:
elementType: O O O O N C C C C C C C C C
charge: -0.237665 -0.263896 -0.283556 -0.097313 -0.047955 0.294542 0.063032 0.116071 -0.171739 0.033119 0.057059 0.165515 0.182322 0.190466
polarizability: 1.54362248e+02 -5.10187492e+00 1.47194456e+02 1.77376734e+00 2.33189346e+00 7.25076312e+01
1716.lowfreq: -7.1548 -4.8824 0.0006 0.0006 0.0009 8.2852 52.1385 65.6313 66.7381
frequency: 52.1201 65.6237 66.7367 96.6802 116.8153 139.5987 152.4061 160.1149 176.1078 180.6220 205.3235 228.2008 261.6643 267.1455 309.9964 353.8799 355.3210 388.8651 447.4402 483.1510 517.2126 582.3681 614.2559 618.9110 692.1040 722.9356 755.3160 849.4183 865.0950 925.9003 948.7136 960.4706 987.3356 1011.4699 1083.5275 1109.8560 1110.2861 1112.6907 1136.1871 1148.4727 1153.4508 1156.0836 1160.8023 1205.5027 1288.2426 1334.6773 1335.9951 1355.0661 1376.2683 1416.0831 1439.4846 1440.3835 1448.1331 1454.0635 1461.2454 1462.1244 1467.6853 1467.8058 1472.6382 1479.7405 1551.2540 1570.3002 2967.1398 2975.4783 2985.3879 2998.3281 3058.5218 3060.9643 3081.1958 3098.9015 3127.2057 3131.2358 3135.1057 3178.0016 3555.0529
redmass: 3.8725 2.6625 2.7256 2.4806 3.1240 3.5981 1.2688 1.3474 2.0068 2.9911 2.8674 2.3391 2.5154 3.7937 3.7135 4.4332 1.7094 2.5980 6.0531 5.7771 7.2980 4.9148 4.3059 8.0655 5.0668 6.5310 7.1953 1.3132 7.3809 4.8178 9.4394 2.8367 2.9749 4.5130 6.4705 1.2398 1.2586 1.2512 1.9664 1.3111 1.2665 1.4209 1.7180 2.3974 1.5615 2.6952 4.6683 1.9286 2.4992 1.3882 1.3039 1.3331 1.0559 1.2316 1.2813 1.1876 1.0544 1.0673 1.3120 1.0563 8.4863 6.3981 1.0326 1.0332 1.0630 1.0291 1.1042 1.0997 1.0998 1.1042 1.1038 1.1001 1.1047 1.0913 1.0661
irintensity: 1.9463 7.4987 5.4887 8.5254 1.1177 2.3691 1.4273 1.3070 8.5116 6.0737 5.0489 0.7393 3.6652 5.8872 25.1856 4.5554 100.4014 75.0842 13.5848 22.3212 11.5037 16.0820 7.0564 1.4593 6.3575 4.3910 1.9712 32.6336 0.5160 62.1124 35.8720 27.3292 7.7492 20.0556 277.8134 14.3399 0.3502 0.0927 49.0603 68.3225 10.0369 8.7574 44.1728 78.1280 40.0810 91.9967 61.2716 95.0704 78.7795 24.9300 22.0824 42.5714 13.0701 35.0552 67.5889 43.7072 23.2281 44.5820 19.0541 14.7429 13.1110 215.7029 62.1873 81.8685 36.1504 58.3961 41.1580 15.7754 33.2670 31.8133 17.4064 21.1358 25.1229 1.3595 6.7286
temp: 298.150 k
press: 1.00000 atm
elementType: 8 8 8 8 7 6 6 6 6 6 6 6 6 6 1 1 1 1 1 1 1 1 1 1 1 1 1
symmnumber: 1
zpe: 556920.8 jmol-1
zpe.correction: 0.212120 hartree
zpe.thermalcorrener: 0.227565 hartree
zpe.thermalcorrenthalpy: 0.228509 hartree
zpe.thermalcorrgfe: 0.169419 hartree
zpe.sumelectzpe: -705.258574 hartree
zpe.sumelectthermal: -705.243128 hartree
zpe.sumelectthermalent: -705.242184 hartree
zpe.sumelectthermalfe: -705.301275 hartree
dipole: -0.0591 -0.0354 2.1196
dipole: 2.1207
quadrupole: -82.1237 -74.1014 -79.8593
quadrupole: -11.8869 1.0413 1.5349
quadrupole: -3.4289 4.5934 -1.1645 -11.8869 1.0413 1.5349
hfenergy: -705.4706936 hartree
pointgroup: C01 [X(C9H13N1O4)]
dipole: -0.0601348 -0.0023288 0.832164 debye
polarizability: 153.1459232|-5.6521021|148.1275686|5.4948903|1.0622768|72.7908434 unknown
InChI: InChI=1S/C9H13NO4/c1-12-7-4-6(5-11)10-9(14-3)8(7)13-2/h4,11H,5H2,1-3H3
charge 0 multiplicity 1
27 atoms
O  -0.208306 2.694661 -0.119376
O  2.134429 1.348282 -0.108264
O  2.09709 -1.503795 0.023681
O  -3.90392 -0.965822 0.391058
N  -0.270096 -1.521955 -0.000037
C  -0.289602 1.305959 -0.08758
C  -1.448971 -0.833869 -0.060022
C  0.952625 0.608877 -0.033298
C  -1.507054 0.572718 -0.107674
C  0.884032 -0.815849 -0.003779
C  -2.715579 -1.67867 -0.09943
C  -1.466867 3.443348 -0.224225
C  3.155876 1.107284 0.933462
C  2.016195 -2.978227 -0.004612
H  -2.483844 1.057119 -0.169824
H  -2.971449 -1.942911 -1.140569
H  -2.533233 -2.619521 0.457605
H  3.973141 1.802124 0.688539
H  3.508812 0.063068 0.903938
H  2.746927 1.345999 1.93409
H  -1.163284 4.499794 -0.246292
H  -2.119765 3.258263 0.650344
H  -2.008737 3.188438 -1.154686
H  1.496841 -3.321257 -0.915362
H  1.475244 -3.358917 0.878336
H  3.066142 -3.306901 0.000048
H  -3.760948 -0.732641 1.343632
