program: Gaussian 09
title: 000138402
version: EM64L-G09RevD.01
frameworkgroup: C1[X(C6H2Cl6N2)]
method: RPBEPBE
basis: SDD
operation: Freq
keyword: #p
keyword: freq=noraman
keyword: PBEPBE/SDD
title: #p freq=noraman PBEPBE/SDD
converged: YES YES NO NO
title: Mulliken charges:
elementType: Cl Cl Cl Cl Cl Cl N N C C C C C C H H
charge: -0.001011 0.101179 0.155764 0.101217 0.001273 0.031430 0.079508 -0.653309 0.426203 -0.345186 0.712086 -0.763139 -0.168239 -0.349579 0.335579 0.336223
chargesum: 0.00000
title: Mulliken charges with hydrogens summed into heavy atoms:
elementType: Cl Cl Cl Cl Cl Cl N N C C C C C C
charge: -0.001011 0.101179 0.155764 0.101217 0.001273 0.031430 0.079508 0.018493 0.426203 -0.345186 0.712086 -0.763139 -0.168239 -0.349579
polarizability: 1.83406271e+02 -1.15503789e+01 1.66278075e+02 2.53149698e-03 1.10015997e-03 7.84106232e+01
1716.lowfreq: -7.3635 -4.7909 0.0008 0.0008 0.0027 2.3296 35.9850 43.6911 103.6351
frequency: 35.9778 43.6625 103.6335 113.0343 117.8650 167.2262 192.0923 195.1817 200.2590 234.8603 266.3211 278.7584 295.9013 311.9392 327.9930 356.8994 378.5956 403.5177 515.7425 524.7818 545.5963 559.5375 583.7895 590.3991 609.1852 703.8112 719.6454 754.0446 761.9214 875.8252 995.0738 1054.8148 1083.8627 1252.7561 1341.3726 1399.1425 1438.1531 1523.8030 1553.3537 1628.5677 3528.1131 3672.2384
redmass: 24.2188 29.7330 9.3560 14.2444 25.9245 30.9652 31.8578 30.4265 15.5407 22.0070 18.8385 20.2455 9.6785 21.0009 5.0415 19.7988 8.1615 14.8847 1.0671 15.5815 1.2245 10.0041 12.6305 5.1592 11.3738 12.2180 9.9336 11.1324 12.1197 11.3571 11.1237 9.4589 1.6311 11.4043 6.7382 11.7348 8.2611 8.8530 3.5357 1.4699 1.0452 1.1044
irintensity: 0.6609 0.0016 0.8775 1.0335 0.4959 0.7104 0.7171 0.0056 1.3385 1.1275 0.3368 0.6984 1.6821 0.0460 5.2546 2.6901 1.1568 9.1337 0.2260 87.1098 274.3869 1.3758 46.8616 14.9895 1.9107 124.7646 25.6766 96.1536 17.0708 88.7098 22.7857 77.6412 81.7256 135.1191 170.1147 5.4534 41.4481 39.7160 38.1837 340.2144 101.5356 57.2113
temp: 298.150 k
press: 1.00000 atm
elementType: 17 17 17 17 17 17 7 7 6 6 6 6 6 6 1 1
symmnumber: 1
zpe: 192833.5 jmol-1
zpe.correction: 0.073446 hartree
zpe.thermalcorrener: 0.087958 hartree
zpe.thermalcorrenthalpy: 0.088902 hartree
zpe.thermalcorrgfe: 0.030115 hartree
zpe.sumelectzpe: -3098.662482 hartree
zpe.sumelectthermal: -3098.647971 hartree
zpe.sumelectthermalent: -3098.647027 hartree
zpe.sumelectthermalfe: -3098.705814 hartree
dipole: 2.7136 4.7627 0.0004
dipole: 5.4815
quadrupole: -122.6581 -112.7897 -122.5657
quadrupole: 8.7150 -0.0001 0.0003
quadrupole: -3.3203 6.5481 -3.2278 8.7150 -0.0001 0.0003
hfenergy: -3098.7359287 hartree
pointgroup: C01 [X(C6H2Cl6N2)]
dipole: 1.2374229 -1.7662522 0.0016277 debye
dipolederiv: -0.2342147 -0.2334528 0.0001933 -0.3240943 -0.6416181 0.0005728 0.0002937 0.0006097 0.0052584 -0.3929606 -0.0477587 0.2134223 -0.1151536 -0.2214326 0.2271303 0.2275155 0.1957161 -0.5950204 -0.1490045 0.1693085 -0.0001634 0.1307098 -0.6177472 0.0004952 -0.0001254 0.0004931 -0.1207003 -0.3927672 -0.0481054 -0.2132696 -0.1155076 -0.2222138 -0.2278671 -0.2272232 -0.196426 -0.5943372 -0.8842103 0.0252047 -0.0001194 0.1166521 -0.0753763 0.0000724 -0.0001799 0.0000488 -0.008889 -0.314775 -0.3594759 0.0002611 -0.4314562 -0.6483348 0.0004477 0.000317 0.0004729 -0.0399833 -1.007118 -0.4806919 0.0002734 0.0376204 -0.6320577 0.0004126 -0.0002249 0.0003051 -0.1621841 -0.4810319 0.505905 -0.0004321 0.5221192 -1.1424187 0.0005065 -0.0004341 0.0005034 -0.6200718 0.2781273 -0.0268321 0.0001044 0.1292102 0.1425335 -0.0001485 -0.000061 -0.0001492 -0.0765941 0.0290634 0.8011255 -0.0007445 0.3938483 0.6256075 -0.000673 -0.000401 -0.0006245 -0.0836241 0.1430738 -0.6168972 0.0005496 -0.6757409 1.0073661 -0.0007671 0.0005802 -0.0007695 0.1814394 1.079604 -0.1481434 0.0000998 -0.0111418 1.1811017 0.0001783 0.0000007 0.0001386 1.3850238 1.1362081 -0.2404893 0.0003179 -0.0142334 -0.5276549 0.0003758 0.000117 0.0003458 -0.072679 0.7479576 0.8103229 -0.0005612 0.4632377 1.2107712 -0.0008762 -0.0002336 -0.0008158 0.0708564 0.2316733 -0.0734319 0.0000506 -0.0563176 0.2619554 0.0000888 0.0000364 0.0000882 0.3682919 0.2103748 -0.0365878 0.0000175 -0.0497525 0.2995186 0.0000516 0.0000226 0.0000632 0.3632135 unknown
polarizability: 181.1165843|12.9378104|168.5676925|0.0014134|-0.0782774|78.4106927 unknown
InChI: InChI=1S/C6H2Cl6N2/c7-1-3(13)2(8)5(9)14-4(1)6(10,11)12/h13H2
charge 0 multiplicity 1
16 atoms
Cl -1.026122 -2.654774 0.002262
Cl -3.015218 -0.392348 1.523262
Cl -2.715715 2.176621 -0.002662
Cl -3.014742 -0.395194 -1.523806
Cl 3.861147 -0.055285 0.000356
Cl 2.251951 2.822877 -0.0022
N  0.017504 1.317221 -0.001309
N  1.9504 -2.408242 0.002206
C  -0.736026 0.185658 -0.000442
C  -0.113547 -1.08194 0.000819
C  1.31757 -1.192583 0.001078
C  -2.252959 0.391441 -0.000922
C  2.052011 0.034333 0.000103
C  1.35129 1.250003 -0.001013
H  2.967769 -2.451441 0.002347
H  1.402687 -3.266847 0.002922
