program: Gaussian 09
title: 000138400
version: EM64L-G09RevD.01
frameworkgroup: C1[X(C5H10O2S)]
method: RPBEPBE
basis: SDD
operation: Freq
keyword: #p
keyword: freq=noraman
keyword: PBEPBE/SDD
title: #p freq=noraman PBEPBE/SDD
converged: YES YES NO NO
title: Mulliken charges:
elementType: S O O C C C C C H H H H H H H H H H
charge: 0.963739 -0.568209 -0.577017 -0.587892 -0.587894 -0.377788 -0.377788 -0.367391 0.292852 0.258950 0.258951 0.292852 0.251644 0.225446 0.225446 0.251644 0.195512 0.226943
chargesum: 0.00000
title: Mulliken charges with hydrogens summed into heavy atoms:
elementType: S O O C C C C C
charge: 0.963739 -0.568209 -0.577017 -0.036091 -0.036091 0.099302 0.099302 0.055065
polarizability: 9.09788097e+01 3.98832099e-05 7.97756683e+01 -2.85904991e+00 1.73923931e-05 7.46966586e+01
1716.lowfreq: 0.0022 0.0024 0.0027 17.0690 21.3176 33.6960 104.5114 164.1492 216.2766
frequency: 104.4304 164.0368 216.2346 219.5590 278.8977 295.3736 335.8233 374.4119 377.7240 476.6508 509.7620 577.8535 784.9468 797.7544 799.7555 827.4447 881.0402 912.1872 937.5451 947.9961 1032.9934 1054.7299 1066.9248 1115.0100 1143.6095 1185.2619 1227.1668 1250.7300 1254.7439 1294.6485 1340.3073 1355.3654 1357.3221 1414.3744 1419.0497 1447.7304 1463.6135 1465.9874 2975.7354 2987.8396 2987.8791 3036.6628 3037.6478 3045.8886 3047.8606 3056.4959 3131.3421 3133.7339
redmass: 3.7344 3.9099 2.8077 3.4804 5.4378 3.4718 1.6843 6.9199 4.0737 2.7469 2.3214 3.4986 5.8550 3.0198 1.7007 1.5518 1.5108 5.4492 2.0972 2.4030 1.9493 1.0860 1.6241 1.6264 1.3179 1.4486 1.3780 1.2252 1.2620 1.1888 1.3814 1.3917 1.4294 1.1109 1.0954 1.0765 1.0784 1.0871 1.0641 1.0612 1.0630 1.0704 1.0753 1.0813 1.0864 1.0974 1.1093 1.1102
irintensity: 4.5971 0.1826 12.4225 3.9248 7.0989 16.6523 1.8802 10.9552 11.2492 1.4986 5.8185 35.0051 44.3200 1.6673 3.6357 31.3355 16.2660 72.1539 0.0783 34.0131 3.4849 0.0010 10.4400 0.6508 0.5680 5.5485 3.6554 3.3914 3.0046 0.4128 3.2613 1.0346 0.3669 4.3930 15.3774 10.4050 24.4327 12.0140 28.5745 34.9756 11.6549 0.0404 17.5174 9.6640 7.4757 40.2593 1.6302 5.2870
temp: 298.150 k
press: 1.00000 atm
elementType: 16 8 8 6 6 6 6 6 1 1 1 1 1 1 1 1 1 1
symmnumber: 1
zpe: 383702.7 jmol-1
zpe.correction: 0.146145 hartree
zpe.thermalcorrener: 0.154716 hartree
zpe.thermalcorrenthalpy: 0.155660 hartree
zpe.thermalcorrgfe: 0.113262 hartree
zpe.sumelectzpe: -744.228016 hartree
zpe.sumelectthermal: -744.219445 hartree
zpe.sumelectthermalent: -744.218501 hartree
zpe.sumelectthermalfe: -744.260899 hartree
dipole: -6.1976 0.0000 -2.2378
dipole: 6.5893
quadrupole: -65.9883 -49.4705 -62.4286
quadrupole: 0.0000 0.2843 0.0000
quadrupole: -6.6925 9.8253 -3.1329 0.0000 0.2843 0.0000
hfenergy: -744.3741609 hartree
pointgroup: C01 [X(C5H10O2S1)]
dipole: 2.4394496 0.0000241 0.8773231 debye
dipolederiv: 1.3364557 -0.0000007 0.0316147 -0.0000017 1.1459107 0.0000006 0.0225339 0.0000011 1.1660498 -0.7747444 0.000006 0.0362983 0.0000176 -0.570099 -0.0000002 0.1943588 -0.0000029 -0.5636181 -0.5793993 0.0000009 0.0133789 -0.0000079 -0.5688524 -0.0000094 -0.1172858 -0.0000073 -0.6995912 -0.0431223 -0.0434576 -0.0118756 -0.0725083 -0.0391366 -0.0008024 -0.0256855 0.0188954 -0.0485196 -0.043121 0.0434562 -0.0118821 0.0725036 -0.0391449 0.0008018 -0.0256964 -0.0188959 -0.0485176 0.0048644 0.0286971 0.0218419 0.1296338 -0.0492932 -0.0019644 -0.0644852 0.0542824 0.0438171 0.0048615 -0.0286951 0.0218456 -0.1296442 -0.0492942 0.0019773 -0.0644683 -0.0542671 0.0438254 0.0730579 0.0000003 0.0094997 0.0000034 0.0427949 0.0000087 0.0462037 0.0000082 0.1687057 0.0046099 -0.0419853 -0.0126223 -0.051924 -0.026452 -0.0109089 -0.0222948 -0.0157251 0.082713 0.0212248 0.0492542 -0.0227851 0.0551929 0.0415264 -0.0068732 0.0112626 0.0050179 -0.0805749 0.0212218 -0.0492568 -0.0227771 -0.0551904 0.0415303 0.0068559 0.0112705 -0.0050362 -0.0805741 0.004614 0.0419818 -0.0126281 0.0519199 -0.0264506 0.0109252 -0.0223022 0.0157421 0.0827089 0.0782389 -0.0457349 -0.0398083 -0.0508571 0.0898081 0.0247835 0.0112628 -0.0367737 -0.0809108 -0.0584031 0.1425821 -0.0175433 0.0689121 -0.0746052 0.0348419 -0.000987 0.0292046 0.1062183 -0.0584099 -0.1425851 -0.0175238 -0.0689133 -0.074609 -0.0348157 -0.0009783 -0.029179 0.1062276 0.0782413 0.0457295 -0.0398149 0.050859 0.0898069 -0.024807 0.0112568 0.036749 -0.0809134 0.0880264 -0.0000004 0.0098105 -0.0000058 0.0133303 -0.0000132 -0.0679914 -0.0000121 -0.1753256 -0.1582168 0.0000078 0.0649711 0.0000104 0.0532295 -0.0000005 0.1040256 -0.0000013 0.0582794 unknown
polarizability: 90.971527|-0.0004322|79.7756683|-2.8797034|-0.0003331|74.7039413 unknown
InChI: InChI=1S/C5H10O2S/c6-8(7)4-2-1-3-5-8/h1-5H2
charge 0 multiplicity 1
18 atoms
S  -1.154696 0.000037 -0.06756
O  -2.516765 0.000125 0.838757
O  -1.203089 -0.00008 -1.707721
C  -0.020775 -1.478936 0.467034
C  -0.020731 1.47905 0.466821
C  1.354408 -1.298609 -0.187186
C  1.354448 1.298585 -0.187371
C  2.085775 0.000009 0.243951
H  -0.571289 -2.367853 0.120303
H  -0.016473 -1.424145 1.568297
H  -0.016433 1.42442 1.568092
H  -0.571214 2.367934 0.119957
H  1.229627 -1.31382 -1.287201
H  1.972605 -2.179428 0.076037
H  1.972672 2.179424 0.075724
H  1.229672 1.313642 -1.28739
H  2.224486 0.000084 1.344859
H  3.097173 -0.000038 -0.202906
