program: Gaussian 09
title: 000138394
version: EM64L-G09RevD.01
frameworkgroup: C1[X(CH3Cl)]
method: RPBEPBE
basis: SDD
operation: Freq
keyword: #pfreq=noraman
keyword: PBEPBE/SDD
title: #p freq=noraman PBEPBE/SDD
converged: YES YES YES YES
title: Mulliken charges:
elementType: Cl C H H H
charge: -0.079991 -0.728589 0.269512 0.269517 0.269551
chargesum: 0.00000
title: Mulliken charges with hydrogens summed into heavy atoms:
elementType: Cl C
charge: -0.079991 0.079991
polarizability: 2.81082862e+01 -8.59071422e-04 1.30493578e+01 5.26437257e-05 -9.30846097e-05 1.30499370e+01
1716.lowfreq: -12.6189 -0.0049 -0.0027 0.0021 9.8209 39.1931 653.5691 991.6077 991.9873
frequency: 653.5691 991.6076 991.9872 1354.8379 1452.3025 1452.5039 3032.3382 3166.1937 3166.7878
redmass: 8.0575 1.1573 1.1574 1.1142 1.0598 1.0598 1.0258 1.1077 1.1077
irintensity: 20.7267 7.6411 7.6434 3.9382 13.2173 13.2296 20.6113 17.7553 17.7379
temp: 298.150 k
press: 1.00000 atm
elementType: 17 6 1 1 1
symmnumber: 1
zpe: 97269.1 jmol-1
zpe.correction: 0.037048 hartree
zpe.thermalcorrener: 0.040110 hartree
zpe.thermalcorrenthalpy: 0.041054 hartree
zpe.thermalcorrgfe: 0.013280 hartree
zpe.sumelectzpe: -499.780523 hartree
zpe.sumelectthermal: -499.777461 hartree
zpe.sumelectthermalent: -499.776517 hartree
zpe.sumelectthermalfe: -499.804291 hartree
dipole: 2.3371 0.0000 0.0000
dipole: 2.3371
quadrupole: -17.7653 -19.6854 -19.6858
quadrupole: -0.0001 0.0001 0.0000
quadrupole: 1.2802 -0.6399 -0.6403 -0.0001 0.0001 0.0000
hfenergy: -499.8175712 hartree
pointgroup: C01 [X(C1H3Cl1)]
dipole: -0.9194855 0. 0.0000299 debye
dipolederiv: -0.4387816 0.0000057 0.0000257 -0.0000288 -0.1893217 0.0000004 -0.0000709 -0.0000053 -0.1893565 0.5435952 -0.0000293 -0.000089 -0.000046 0.125899 -0.0000299 -0.0000025 -0.0000263 0.1258783 -0.034947 -0.0476657 0.0518736 -0.0441956 0.0301775 0.106894 0.0480494 0.1069129 0.0121511 -0.0348846 0.0687291 0.0153334 0.0637734 -0.0759381 -0.0455955 0.0142076 -0.0456274 0.1182264 -0.034982 -0.0210398 -0.0671437 -0.019503 0.1091833 -0.061269 -0.0621836 -0.0612538 -0.0668993 unknown
polarizability: 28.108286|-0.0001759|13.0498014|-0.0016019|-0.0002623|13.0494935 unknown
InChI: InChI=1S/CH3Cl/c1-2/h1H3
charge 0 multiplicity 1
5 atoms
Cl 0.955041 0.0000 -0.000087
C  -0.920097 -0.000017 -0.000022
H  -1.25224 -0.708406 0.770833
H  -1.252181 1.021739 0.228166
H  -1.252123 -0.313315 -0.99889
