program: Gaussian 09
title: 000138391
version: EM64L-G09RevD.01
frameworkgroup: C1[X(C9H10)]
method: RPBEPBE
basis: SDD
operation: Freq
keyword: #p
keyword: freq=noraman
keyword: PBEPBE/SDD
title: #p freq=noraman PBEPBE/SDD
converged: YES YES NO NO
title: Mulliken charges:
elementType: C C C C C C C C C H H H H H H H H H H
charge: -0.206517 -0.206519 -0.243073 -0.243072 -0.515503 -0.273055 -0.273052 -0.221279 -0.221281 0.243108 0.243108 0.241704 0.241705 0.231394 0.239432 0.244105 0.244103 0.237346 0.237347
chargesum: 0.00000
title: Mulliken charges with hydrogens summed into heavy atoms:
elementType: C C C C C C C C C
charge: 0.036591 0.036589 -0.001368 -0.001368 -0.044677 -0.028951 -0.028949 0.016067 0.016066
polarizability: 9.19219259e+01 1.71350472e-04 8.85148667e+01 -4.79930385e+00 2.90633794e-05 6.63655385e+01
1716.lowfreq: -18.7930 0.0005 0.0007 0.0009 9.8624 34.5390 216.3617 270.2113 393.2973
frequency: 216.3167 270.2092 393.2955 399.5396 458.0752 504.6012 658.7513 698.3429 719.7796 771.7528 786.7902 844.1540 859.7685 872.6803 890.1960 894.1528 916.3179 921.0273 927.6169 963.6437 975.3994 990.1858 1005.5497 1012.7220 1058.6980 1086.5219 1098.8779 1134.0844 1146.7942 1173.2670 1209.2438 1219.2904 1226.7802 1249.5881 1260.0401 1268.1334 1281.6588 1309.4423 1470.0154 1555.5715 1577.7420 3029.9673 3031.7049 3045.0911 3074.5261 3082.7474 3100.3476 3136.7716 3150.4498 3177.6339 3184.2798
redmass: 2.9588 2.9154 2.9470 2.8898 3.2977 1.8614 3.7408 1.6765 1.7790 3.8855 2.4353 1.9795 3.3747 1.7483 2.7202 2.3817 1.4459 3.0794 1.7105 2.0262 2.3170 1.4180 1.6023 1.2590 1.5578 1.2476 1.1430 1.8736 1.9432 1.4086 1.5956 1.3168 1.6752 1.4815 1.3697 1.8746 1.5892 1.6616 1.1013 5.8053 5.7765 1.0596 1.0858 1.0879 1.0880 1.0926 1.1062 1.0856 1.0869 1.1178 1.1096
irintensity: 0.1066 3.1022 1.6310 1.0717 1.3881 8.0984 0.0068 8.7501 109.3693 5.5851 56.5500 5.6515 2.0117 1.1987 2.7843 2.0562 2.4937 1.7867 0.0133 4.6379 0.3710 3.0332 0.2304 3.5765 3.1684 2.2875 0.0616 4.1486 0.8734 8.6011 5.6536 0.5612 0.4298 7.9729 0.1066 11.8494 3.2910 14.6609 12.9270 6.3499 1.9485 37.0498 12.9963 52.8654 68.1339 7.4960 26.5816 12.8177 8.4065 39.1956 19.3051
temp: 298.150 k
press: 1.00000 atm
elementType: 6 6 6 6 6 6 6 6 6 1 1 1 1 1 1 1 1 1 1
symmnumber: 1
zpe: 420428.4 jmol-1
zpe.correction: 0.160133 hartree
zpe.thermalcorrener: 0.166487 hartree
zpe.thermalcorrenthalpy: 0.167431 hartree
zpe.thermalcorrgfe: 0.129991 hartree
zpe.sumelectzpe: -348.205424 hartree
zpe.sumelectthermal: -348.199070 hartree
zpe.sumelectthermalent: -348.198125 hartree
zpe.sumelectthermalfe: -348.235566 hartree
dipole: -0.0592 0.0000 -0.0636
dipole: 0.0869
quadrupole: -53.8895 -50.1281 -54.1808
quadrupole: 0.0001 -2.3524 0.0001
quadrupole: -1.1567 2.6047 -1.4480 0.0001 -2.3524 0.0001
hfenergy: -348.3655566 hartree
pointgroup: C01 [X(C9H10)]
dipole: -0.0240467 -0.0000029 0.0243005 debye
dipolederiv: 0.0414703 0.0433166 -0.0197092 0.073825 -0.1432088 0.0429738 -0.0859222 0.1089108 0.1644849 0.0414552 -0.0433029 -0.0197182 -0.073783 -0.1431521 -0.0431058 -0.0859268 -0.1090406 0.1644258 -0.0503472 0.0329197 -0.0717947 -0.0103538 0.1748205 -0.0527945 -0.0623785 -0.1407517 0.0265521 -0.0503316 -0.0328926 -0.0718143 0.0103783 0.1747369 0.0528546 -0.062389 0.1408138 0.0266403 0.1052269 -0.0000033 0.0282404 0.0000004 -0.1038416 -0.0000276 0.0027208 -0.0000271 0.0221058 -0.0132835 -0.1207163 0.1205361 0.0609166 0.0581809 -0.0372213 0.2013708 -0.085108 -0.2139352 -0.0132722 0.1206638 0.1205823 -0.0609904 0.0581486 0.0373331 0.2013511 0.0852386 -0.2138963 -0.0380929 -0.0478118 0.1733492 -0.1367648 -0.0274181 0.0017465 0.2251967 0.0891065 -0.1325619 -0.0380987 0.0477344 0.1733694 0.1366628 -0.0273767 -0.0016919 0.225254 -0.0890583 -0.1326058 0.0218734 -0.0529358 -0.0166102 -0.0068586 0.0239086 -0.0916484 0.0036448 -0.1189897 -0.1214834 0.021873 0.0529443 -0.0165981 0.006858 0.0238203 0.0917119 0.0036371 0.1190497 -0.1213999 0.0487345 -0.0043176 0.0049423 -0.0192275 -0.156105 0.0728047 0.0151664 0.0859093 0.0412786 0.0487323 0.0043202 0.0049471 0.019223 -0.1560347 -0.0728907 0.0151781 -0.0859935 0.0412099 -0.0486307 0.0000351 -0.1689562 0.0000244 0.0669011 0.0000156 -0.1151842 0.0000121 -0.0016887 -0.0760001 -0.0000367 0.1573466 -0.000025 0.0721207 0.0000247 0.102821 0.0000244 -0.0311961 -0.0336622 0.1013346 -0.0844629 0.1060109 0.0216428 0.0421099 -0.1381387 0.0496963 0.1581927 -0.0336615 -0.1013015 -0.0844986 -0.1059652 0.0216684 -0.0421644 -0.138179 -0.0497647 0.1581584 0.0330109 -0.0569215 -0.1145875 -0.0684146 0.0306209 -0.0654561 -0.1541258 -0.0695215 0.0828264 0.0330041 0.0569714 -0.1145636 0.0684835 0.0305675 0.065426 -0.1540964 0.0694937 0.0828923 unknown
polarizability: 91.5980949|-0.0012381|88.5148658|5.58609|0.0044131|66.6893705 unknown
InChI: InChI=1S/C9H10/c1-2-7-5-6(1)8-3-4-9(7)8/h1-4,6-9H,5H2
charge 0 multiplicity 1
19 atoms
C  -0.629482 0.801336 0.578395
C  -0.629447 -0.801572 0.578063
C  0.603138 1.146154 -0.340422
C  0.603172 -1.14597 -0.340915
C  0.550262 0.000323 -1.402685
C  -2.033445 0.684011 -0.052697
C  -2.033429 -0.684047 -0.052936
C  1.816365 0.682572 0.490631
C  1.8164 -0.682725 0.490318
H  -0.577436 1.295924 1.563941
H  -0.577354 -1.29657 1.5634
H  0.633138 2.179892 -0.717476
H  0.633193 -2.179542 -0.718419
H  -0.368925 0.000444 -2.011445
H  1.436278 0.00048 -2.059697
H  -2.751291 1.439271 -0.38627
H  -2.751256 -1.439201 -0.386794
H  2.479822 1.346991 1.051665
H  2.479895 -1.34737 1.051042
