program: Gaussian 09
title: 000138390
version: EM64L-G09RevD.01
frameworkgroup: C1[X(C7H10)]
method: RPBEPBE
basis: SDD
operation: Freq
keyword: #p
keyword: freq=noraman
keyword: PBEPBE/SDD
title: #p freq=noraman PBEPBE/SDD
converged: YES YES NO YES
title: Mulliken charges:
elementType: C C C C C C C H H H H H H H H H H
charge: -0.198896 -0.198882 -0.430413 -0.430418 -0.432072 -0.262929 -0.262930 0.230954 0.230947 0.216939 0.201375 0.201376 0.216944 0.217676 0.218548 0.240892 0.240888
chargesum: 0.00000
title: Mulliken charges with hydrogens summed into heavy atoms:
elementType: C C C C C C C
charge: 0.032059 0.032065 -0.012099 -0.012098 0.004152 -0.022037 -0.022042
polarizability: 6.89598403e+01 -1.97818155e-03 7.42177537e+01 4.04302334e+00 1.57039420e-03 5.83464873e+01
1716.lowfreq: -12.7256 -4.0195 -0.0006 -0.0004 0.0004 16.5517 186.9954 221.9444 343.5219
frequency: 186.9606 221.9423 343.5213 389.0569 559.7516 623.3389 743.5709 798.0076 806.2094 836.5142 878.6205 880.3865 889.9787 930.4736 939.1976 955.0154 1021.8843 1050.7651 1058.6728 1089.7000 1099.4361 1148.7646 1152.1091 1202.4840 1236.5038 1245.4350 1256.1600 1279.6418 1294.5494 1315.1915 1316.2429 1454.5308 1461.6897 1472.1276 1566.7256 2982.9893 2983.7703 3004.9884 3021.4034 3037.0202 3048.8711 3048.8867 3072.6569 3129.5887 3171.7451
redmass: 2.3690 2.0672 1.9571 2.2144 1.8298 3.9701 1.4448 1.9353 2.2497 1.9998 4.3734 2.7413 1.3145 1.5436 1.8420 2.0117 1.3231 1.3170 1.4087 1.8829 1.1484 1.8526 1.9039 1.4378 1.3190 1.9205 1.4149 1.5603 1.4873 1.4334 1.4612 1.0873 1.0817 1.0982 5.6836 1.0614 1.0612 1.0631 1.0853 1.0886 1.1010 1.1003 1.1049 1.0853 1.1180
irintensity: 0.0263 0.1958 3.1775 0.5680 10.3290 0.6011 70.8899 3.7300 3.6100 15.6276 0.4437 1.5085 9.4576 1.3051 2.9864 0.4577 2.2380 5.8474 0.1195 3.2961 4.1571 0.0211 2.2751 0.8286 1.2546 2.8619 6.7682 0.0458 9.7281 0.7592 1.8634 8.0541 7.5019 7.8179 2.6834 43.1352 30.3833 41.9136 45.2968 65.2354 20.0984 21.7186 76.6001 15.4769 34.1039
temp: 298.150 k
press: 1.00000 atm
elementType: 6 6 6 6 6 6 6 1 1 1 1 1 1 1 1 1 1
symmnumber: 1
zpe: 390024.9 jmol-1
zpe.correction: 0.148553 hartree
zpe.thermalcorrener: 0.154454 hartree
zpe.thermalcorrenthalpy: 0.155399 hartree
zpe.thermalcorrgfe: 0.119256 hartree
zpe.sumelectzpe: -272.147907 hartree
zpe.sumelectthermal: -272.142005 hartree
zpe.sumelectthermalent: -272.141061 hartree
zpe.sumelectthermalfe: -272.177204 hartree
dipole: 0.3680 0.0000 0.0960
dipole: 0.3803
quadrupole: -43.7061 -41.7585 -42.5486
quadrupole: -0.0001 1.3090 0.0001
quadrupole: -1.0351 0.9126 0.1225 -0.0001 1.3090 0.0001
hfenergy: -272.2964596 hartree
pointgroup: C01 [X(C7H10)]
dipole: -0.1445564 -0.0000085 0.0386316 debye
dipolederiv: 0.0696828 -0.005581 0.0755368 -0.0299531 -0.0865255 0.0490751 0.0606335 0.0358418 0.1596351 0.0695787 0.0055686 0.0755619 0.0299631 -0.0865391 -0.0490576 0.0605982 -0.0358407 0.1597184 0.0452267 -0.0309275 -0.0661157 0.0305615 0.0482367 -0.0423717 -0.0490364 -0.0528299 0.0838115 0.0452958 0.0309473 -0.0661103 -0.0305555 0.0482251 0.0423671 -0.0490066 0.0528296 0.0837848 0.0779661 -0.0000061 -0.0816268 0.0000054 0.0203364 -0.0000031 -0.0031404 0.0000008 0.0777776 -0.1282527 0.1048955 -0.1733906 -0.0341454 0.0465315 -0.0264378 -0.212082 -0.0898784 -0.1099961 -0.1282131 -0.1048763 -0.1733969 0.0340864 0.0465667 0.0263774 -0.2121192 0.0898903 -0.1100643 0.000421 -0.0116356 -0.0478008 -0.0247329 0.0163041 -0.1106246 -0.0513913 -0.1391177 -0.1287798 0.0004249 0.011625 -0.0478026 0.0247187 0.016316 0.1106271 -0.051396 0.1391119 -0.1288502 0.063646 -0.0158469 0.000422 0.0237159 -0.1383593 0.0876218 -0.0271477 0.1290408 0.0170003 -0.0761061 0.0687455 0.1086121 0.0054465 0.0553393 -0.0271162 0.1113091 -0.0736753 -0.1008685 -0.0761086 -0.0687632 0.1086156 -0.0054632 0.0553367 0.0271252 0.1112909 0.0736775 -0.1008474 0.0636463 0.0158701 0.0004268 -0.0236924 -0.138343 -0.0876249 -0.0271327 -0.1290379 0.0170021 -0.2084624 -0.0000102 -0.0748371 -0.0000102 0.0720761 -0.0000049 -0.0460208 -0.0000055 0.0707674 0.0618561 -0.000002 0.1174571 0.0000013 0.0156804 0.0000069 0.0540611 -0.0000004 -0.1339894 0.0597235 -0.0737034 0.1222281 -0.0911784 0.0044133 0.079719 0.165286 0.0823395 0.0719244 0.059675 0.0737003 0.1222206 0.0912323 0.0044048 -0.0796788 0.1652942 -0.0823466 0.0719741 unknown
polarizability: 68.9117699|-0.0020107|74.2177536|-4.1053518|-0.0019733|58.3945577 unknown
InChI: InChI=1S/C7H10/c1-2-6-4-5-7(6)3-1/h4-7H,1-3H2
charge 0 multiplicity 1
17 atoms
C  0.358795 0.802712 0.641284
C  0.358814 -0.802613 0.641344
C  -1.04312 1.225909 0.131737
C  -1.043025 -1.225949 0.131703
C  -1.558707 -0.000032 -0.674723
C  1.472745 0.683913 -0.418239
C  1.472935 -0.683852 -0.418015
H  0.651264 1.295998 1.585471
H  0.651231 -1.29579 1.585603
H  -1.016635 2.151806 -0.472239
H  -1.707453 1.409711 0.999111
H  -1.707392 -1.409831 0.999034
H  -1.016428 -2.151831 -0.472296
H  -2.657277 -0.000074 -0.792969
H  -1.113742 -0.000011 -1.68692
H  2.034373 1.439983 -0.976204
H  2.034719 -1.439948 -0.975784
